Provdata Avlopp och Slam
type: Collection
notation: PROVDATA_AVLOPP_SLAM
has part: Provomfattning
has part: Reningssteg övergripande
has part: Reningssteg specificerade
has part: Reningsverk, belastning
has part: Slamtyp
has part: Vattentyp för Avlopp och Slam

Provomfattning
type: ConceptScheme
notation: PROV_OMFATT
is part of: Provdata Avlopp och Slam
registration status: Public draft
user modified: staffan
date modified: 2025-02-21 23:18:36.0
vocabulary type: Common
is numeric concept identifiers: false
is notations equal identifiers: false

Delprov
type: Concept
definition: Delprov
status: valid
status modified: 2025-02-21
accepted date: 2025-02-21
in scheme: Provomfattning

Poolat
type: Concept
definition: Poolat prov
status: valid
status modified: 2025-02-21
accepted date: 2025-02-21
in scheme: Provomfattning

Samling
type: Concept
definition: Samlingsprov
status: valid
status modified: 2025-02-21
accepted date: 2025-02-21
in scheme: Provomfattning

Stickprov
type: Concept
definition: Stickprov
status: valid
status modified: 2025-02-21
accepted date: 2025-02-21
in scheme: Provomfattning

Tidsserie
type: Concept
definition: Tidsserie
status: valid
status modified: 2025-02-21
accepted date: 2025-02-21
in scheme: Provomfattning

Reningssteg övergripande
type: ConceptScheme
notation: RENINGSSTEG_OVERGRIP
is part of: Provdata Avlopp och Slam
registration status: Public draft
user modified: staffan
date modified: 2025-02-21 23:51:51.0
vocabulary type: Common
is numeric concept identifiers: false
is notations equal identifiers: false

Annan-ren
type: Concept
definition: Annan kompletterande rening, ange i fritextfältet
status: valid
status modified: 2025-02-21
accepted date: 2025-02-21
in scheme: Reningssteg övergripande

Desinfekt
type: Concept
definition: Desinfektion
status: valid
status modified: 2025-02-21
accepted date: 2025-02-21
in scheme: Reningssteg övergripande

Saknas
type: Concept
definition: Saknas, information ej tillgänglig
status: valid
status modified: 2025-02-21
accepted date: 2025-02-21
in scheme: Reningssteg övergripande

Slam_AnnanBehand
type: Concept
definition: Annan slambehandling, ange i RENINGSSTEG_SPECIFIERADE
status: valid
status modified: 2025-02-21
accepted date: 2025-02-21
in scheme: Reningssteg övergripande

Slam_Behand_Annat-ARV
type: Concept
definition: Slam till annat avloppsreningsverk för behandling
status: valid
status modified: 2025-02-21
accepted date: 2025-02-21
in scheme: Reningssteg övergripande

Slam_Kompost
type: Concept
definition: Komposterat slam
status: valid
status modified: 2025-02-21
accepted date: 2025-02-21
in scheme: Reningssteg övergripande

Slam_Rot
type: Concept
definition: Rötat slam
status: valid
status modified: 2025-02-21
accepted date: 2025-02-21
in scheme: Reningssteg övergripande

Steg1
type: Concept
definition: Steg 1. mekanisk rening (primär)
status: valid
status modified: 2025-02-21
accepted date: 2025-02-21
in scheme: Reningssteg övergripande

Steg1-Steg 3_P-Steg3_N
type: Concept
definition: Steg 1. mekanisk rening; Steg 3. kemisk rening fosfor; Steg 3. biologisk rening, BOD och kväve
status: valid
status modified: 2025-02-21
accepted date: 2025-02-21
in scheme: Reningssteg övergripande

Steg1-Steg2_BOD
type: Concept
definition: Mekanisk rening; Biologisk rening, BOD
status: valid
status modified: 2025-02-21
accepted date: 2025-02-21
in scheme: Reningssteg övergripande

Steg1-Steg2_BOD-Steg3_P
type: Concept
definition: Steg 1, mekanisk rening; Steg 2. biologisk rening, BOD; Steg 3 kemisk rening, fosfor
status: valid
status modified: 2025-02-21
accepted date: 2025-02-21
in scheme: Reningssteg övergripande

Steg1-Steg2_BOD-steg3_P-Steg4_avanc
type: Concept
definition: Steg 1. mekanisk rening; Steg 2. biologisk rening. BOD; Steg 3. kemisk rening fosfor; Steg 4. avancerad rening
status: valid
status modified: 2025-02-21
accepted date: 2025-02-21
in scheme: Reningssteg övergripande

Steg1-Steg2_BOD-steg3_P-Steg4_filt
type: Concept
definition: Steg 1. mekanisk rening; Steg 2. biologisk rening, BOD; Steg 3. kemisk rening fosfor; Steg 4. efterfiltrering
status: valid
status modified: 2025-02-21
accepted date: 2025-02-21
in scheme: Reningssteg övergripande

Steg1-Steg3_N
type: Concept
definition: Steg 1. mekanisk rening; Steg 3. biologisk rening. BOD och kväve
status: valid
status modified: 2025-02-21
accepted date: 2025-02-21
in scheme: Reningssteg övergripande

Steg1-steg3_P
type: Concept
definition: Steg 1. mekanisk rening; Steg 3. kemisk rening, fosfor
status: valid
status modified: 2025-02-21
accepted date: 2025-02-21
in scheme: Reningssteg övergripande

Steg1-Steg3_P-Steg3_N-Steg4_avanc
type: Concept
definition: Steg 1. mekanisk rening; Steg 3. kemisk rening, fosfor; Steg 3. biologisk rening, BOD och kväve; Avancerad rening
status: valid
status modified: 2025-02-21
accepted date: 2025-02-21
in scheme: Reningssteg övergripande

Steg2_BOD
type: Concept
definition: Steg 2. biologisk rening, BOD "Biochemical Oxygen Demand", (sekundär)
status: valid
status modified: 2025-02-21
accepted date: 2025-02-21
in scheme: Reningssteg övergripande

Steg3_N
type: Concept
definition: Steg 3. biologisk rening. BOD och kväve (tertiär)
status: valid
status modified: 2025-02-21
accepted date: 2025-02-21
in scheme: Reningssteg övergripande

Steg3_P
type: Concept
definition: Steg 3. kemisk rening, fosfor (tertiär)
status: valid
status modified: 2025-02-21
accepted date: 2025-02-21
in scheme: Reningssteg övergripande

Steg4_avanc
type: Concept
definition: Steg 4. avancerad rening (kvartär)
status: valid
status modified: 2025-02-21
accepted date: 2025-02-21
in scheme: Reningssteg övergripande

Steg4_filt
type: Concept
definition: Steg 4. efterfiltrering (om avsikten främst är partikelreduktion och inte ”avancerad rening”)
status: valid
status modified: 2025-02-21
accepted date: 2025-02-21
in scheme: Reningssteg övergripande

Reningssteg specificerade
type: ConceptScheme
notation: RENINGSSTEG_SPEC
is part of: Provdata Avlopp och Slam
registration status: Public draft
user modified: staffan
date modified: 2025-02-21 23:59:01.0
vocabulary type: Common
is numeric concept identifiers: false
is notations equal identifiers: false

2pFalln_Steg3_P
type: Concept
definition: Tvåpunktsfällning, Steg 3. kemisk rening, fosfor (tertiär)
status: valid
status modified: 2025-02-21
accepted date: 2025-02-21
in scheme: Reningssteg specificerade

AGS_Steg2_BOD
type: Concept
definition: Aerobt Granulärt Slam, Steg 2. biologisk rening, BOD (sekundär)
status: valid
status modified: 2025-02-21
accepted date: 2025-02-21
in scheme: Reningssteg specificerade

AGS_Steg3_N
type: Concept
definition: Aerobt Granulärt Slam, Steg 3. biologisk rening. BOD och kväve (tertiär)
status: valid
status modified: 2025-02-21
accepted date: 2025-02-21
in scheme: Reningssteg specificerade

AktivtSlam_Steg2_BOD
type: Concept
definition: Aktivt slam, Steg 2. biologisk rening, BOD (sekundär)
status: valid
status modified: 2025-02-21
accepted date: 2025-02-21
in scheme: Reningssteg specificerade

AktivtSlam_Steg3_N
type: Concept
definition: Aktivt slam, Steg 3. biologisk rening. BOD och kväve (tertiär)
status: valid
status modified: 2025-02-21
accepted date: 2025-02-21
in scheme: Reningssteg specificerade

Anammox_Steg3_N
type: Concept
definition: Anammox (anaerob ammonium oxidation), Steg 3. biologisk rening. BOD och kväve (tertiär)
status: valid
status modified: 2025-02-21
accepted date: 2025-02-21
in scheme: Reningssteg specificerade

Annan-ren
type: Concept
definition: Annan kompletterande rening, ange i fritextfältet
status: valid
status modified: 2025-02-21
accepted date: 2025-02-21
in scheme: Reningssteg specificerade

MBBR_Steg2_BOD
type: Concept
definition: Rörligt bärarmaterial ("Moving Bed Biofilm Reactor"), Steg 2. biologisk rening, BOD (sekundär)
status: valid
status modified: 2025-02-21
accepted date: 2025-02-21
in scheme: Reningssteg specificerade

MBBR_Steg3_N
type: Concept
definition: Rörligt bärarmaterial ("Moving Bed Biofilm Reactor"), Steg 3. biologisk rening. BOD och kväve (tertiär)
status: valid
status modified: 2025-02-21
accepted date: 2025-02-21
in scheme: Reningssteg specificerade

Bevattning
type: Concept
definition: Till bevattning
status: valid
status modified: 2025-02-21
accepted date: 2025-02-21
in scheme: Reningssteg specificerade

Bio-ren_Annan
type: Concept
definition: Annan biologisk rening, ange i fritextfältet
status: valid
status modified: 2025-02-21
accepted date: 2025-02-21
in scheme: Reningssteg specificerade

FastBioBadd_Steg2_BOD
type: Concept
definition: Fast biobädd , Steg 2. biologisk rening, BOD (sekundär)
status: valid
status modified: 2025-02-21
accepted date: 2025-02-21
in scheme: Reningssteg specificerade

FastBioBadd_Steg3_N
type: Concept
definition: Fast biobädd , Steg 3. biologisk rening. BOD och kväve (tertiär)
status: valid
status modified: 2025-02-21
accepted date: 2025-02-21
in scheme: Reningssteg specificerade

LuftBioDamm_Steg2_BOD
type: Concept
definition: Luftad biodamm , Steg 2. biologisk rening, BOD (sekundär)
status: valid
status modified: 2025-02-21
accepted date: 2025-02-21
in scheme: Reningssteg specificerade

LuftBioDamm_Steg3_N
type: Concept
definition: Luftad biodamm , Steg 3. biologisk rening. BOD och kväve (tertiär)
status: valid
status modified: 2025-02-21
accepted date: 2025-02-21
in scheme: Reningssteg specificerade

BioP-red_Steg3_P
type: Concept
definition: Biologisk fosforreduktion, Steg 3. kemisk rening, fosfor (tertiär)
status: valid
status modified: 2025-02-21
accepted date: 2025-02-21
in scheme: Reningssteg specificerade

Slam_Centrifug
type: Concept
definition: Slam efter centrifugering, slam med en torrhalt mellan 5-70 % TS
status: valid
status modified: 2025-02-21
accepted date: 2025-02-21
in scheme: Reningssteg specificerade

Denitrifik_Steg3_N
type: Concept
definition: Denitrifikation, Steg 3. biologisk rening. BOD och kväve (tertiär)
status: valid
status modified: 2025-02-21
accepted date: 2025-02-21
in scheme: Reningssteg specificerade

EftFalln_Steg3_P
type: Concept
definition: Efterfällning , Steg 3. kemisk rening, fosfor (tertiär)
status: valid
status modified: 2025-02-21
accepted date: 2025-02-21
in scheme: Reningssteg specificerade

ForFalln_Steg3_P
type: Concept
definition: Förfällning, Steg 3. kemisk rening, fosfor (tertiär)
status: valid
status modified: 2025-02-21
accepted date: 2025-02-21
in scheme: Reningssteg specificerade

ForSed_Steg1
type: Concept
definition: Försedimentering, Steg 1. mekanisk rening (primär)
status: valid
status modified: 2025-02-21
accepted date: 2025-02-21
in scheme: Reningssteg specificerade

GAK_Steg4_avanc
type: Concept
definition: Aktivt kol (GAK), Granulerat Aktivt Kol, Steg 4. avancerad rening (kvartär)
status: valid
status modified: 2025-02-21
accepted date: 2025-02-21
in scheme: Reningssteg specificerade

Infiltration_Steg2_BOD
type: Concept
definition: Infiltration , Steg 2. biologisk rening, BOD (sekundär)
status: valid
status modified: 2025-02-21
accepted date: 2025-02-21
in scheme: Reningssteg specificerade

Slam_Kalk
type: Concept
definition: Kalkning av slam, avser efter att slammet har tagits ut från vattenlinjen, slam med en torrhalt mellan 5-70 % TS
status: valid
status modified: 2025-02-21
accepted date: 2025-02-21
in scheme: Reningssteg specificerade

Slam_Kammarfilter
type: Concept
definition: Slam efter kammarfilterpress, slam med en torrhalt mellan 5-70 % TS
status: valid
status modified: 2025-02-21
accepted date: 2025-02-21
in scheme: Reningssteg specificerade

Kem-ren_Annan
type: Concept
definition: Annan kemisk rening, ange i fritextfältet
status: valid
status modified: 2025-02-21
accepted date: 2025-02-21
in scheme: Reningssteg specificerade

Klor_Steg4_avanc
type: Concept
definition: Klorering eller motsvarande , Steg 4. avancerad rening (kvartär)
status: valid
status modified: 2025-02-21
accepted date: 2025-02-21
in scheme: Reningssteg specificerade

Klor-desinfekt
type: Concept
definition: Klorering eller motsvarande, desinfektion
status: valid
status modified: 2025-02-21
accepted date: 2025-02-21
in scheme: Reningssteg specificerade

Slam_Luftning
type: Concept
definition: Slam uttaget från luftningsbassäng
status: valid
status modified: 2025-02-21
accepted date: 2025-02-21
in scheme: Reningssteg specificerade

Markbadd_Steg2_BOD
type: Concept
definition: Markbädd, Steg 2. biologisk rening, BOD (sekundär)
status: valid
status modified: 2025-02-21
accepted date: 2025-02-21
in scheme: Reningssteg specificerade

MBR_Steg3_N
type: Concept
definition: MembranBioReaktor, Steg 3. biologisk rening. BOD och kväve (tertiär)
status: valid
status modified: 2025-02-21
accepted date: 2025-02-21
in scheme: Reningssteg specificerade

Mekanisk-ren_Steg1
type: Concept
definition: Filter, sil galler etc., Steg 1. mekanisk rening (primär)
status: valid
status modified: 2025-02-21
accepted date: 2025-02-21
in scheme: Reningssteg specificerade

MikroFilt
type: Concept
definition: Mikrofiltrering, membranfiltrering
status: valid
status modified: 2025-02-21
accepted date: 2025-02-21
in scheme: Reningssteg specificerade

N-ren_ej-ExtKol_Steg3_N
type: Concept
definition: Kväverening utan tillsats av extern kolkälla, Steg 3. biologisk rening. BOD och kväve (tertiär)
status: valid
status modified: 2025-02-21
accepted date: 2025-02-21
in scheme: Reningssteg specificerade

N-ren_Annan
type: Concept
definition: Annan kvävereningsprocess, ange i fritextfältet
status: valid
status modified: 2025-02-21
accepted date: 2025-02-21
in scheme: Reningssteg specificerade

N-ren_ExtKol_Steg3_N
type: Concept
definition: Kväverening med tillsats av extern kolkälla, Steg 3. biologisk rening. BOD och kväve (tertiär)
status: valid
status modified: 2025-02-21
accepted date: 2025-02-21
in scheme: Reningssteg specificerade

NanoFilt
type: Concept
definition: Nanofiltrering, membranfiltrering
status: valid
status modified: 2025-02-21
accepted date: 2025-02-21
in scheme: Reningssteg specificerade

Nitrifik_Steg3_N
type: Concept
definition: Nitrifikation, Steg 3. biologisk rening. BOD och kväve (tertiär)
status: valid
status modified: 2025-02-21
accepted date: 2025-02-21
in scheme: Reningssteg specificerade

Ozon_Steg4_avanc
type: Concept
definition: Ozonering, Steg 4. avancerad rening (kvartär)
status: valid
status modified: 2025-02-21
accepted date: 2025-02-21
in scheme: Reningssteg specificerade

Ozon-desinfekt
type: Concept
definition: Ozonering, desinfektion
status: valid
status modified: 2025-02-21
accepted date: 2025-02-21
in scheme: Reningssteg specificerade

PAK_Steg4_avanc
type: Concept
definition: Aktivt kol (PAK), Pulveriserat Aktivt Kol, Steg 4. avancerad rening (kvartär)
status: valid
status modified: 2025-02-21
accepted date: 2025-02-21
in scheme: Reningssteg specificerade

RejektVattenBeh_Annan
type: Concept
definition: Annan rejektvattenbehandling, ange i fritextfältet
status: valid
status modified: 2025-02-21
accepted date: 2025-02-21
in scheme: Reningssteg specificerade

RO-Filt
type: Concept
definition: Omvänd osmos (RO), membranfiltrering
status: valid
status modified: 2025-02-21
accepted date: 2025-02-21
in scheme: Reningssteg specificerade

SandFilt_Steg4_filt
type: Concept
definition: Sandfilter, Steg 4. efterfiltrering
status: valid
status modified: 2025-02-21
accepted date: 2025-02-21
in scheme: Reningssteg specificerade

SBR_Steg2_BOD
type: Concept
definition: SBR, Satsvis Biologisk Rening, Steg 2. biologisk rening, BOD (sekundär)
status: valid
status modified: 2025-02-21
accepted date: 2025-02-21
in scheme: Reningssteg specificerade

SBR_Steg3_N
type: Concept
definition: SBR, Satsvis Biologisk Rening, Steg 3. biologisk rening. BOD och kväve (tertiär)
status: valid
status modified: 2025-02-21
accepted date: 2025-02-21
in scheme: Reningssteg specificerade

Slam_Silband
type: Concept
definition: Slam efter silbandspress, slam med en torrhalt på mellan 5-70 % TS
status: valid
status modified: 2025-02-21
accepted date: 2025-02-21
in scheme: Reningssteg specificerade

SimultanFalln_Steg3_P
type: Concept
definition: Simultanfällning, Steg 3. kemisk rening, fosfor (tertiär)
status: valid
status modified: 2025-02-21
accepted date: 2025-02-21
in scheme: Reningssteg specificerade

SlamBeh_Annan
type: Concept
definition: Annan behandling av slam, avser efter att slammet har tagits ut från vattenlinjen, slam med en torrhalt mellan 5-70 % TS, ange i fritextfältet
status: valid
status modified: 2025-02-21
accepted date: 2025-02-21
in scheme: Reningssteg specificerade

StruvitFalln_Steg3_N
type: Concept
definition: Fällning av fosfor och kväve som struvit (MgNH4PO4 * 6 H2O), Steg 3. biologisk rening. BOD och kväve (tertiär)
status: valid
status modified: 2025-02-21
accepted date: 2025-02-21
in scheme: Reningssteg specificerade

UltraFilt
type: Concept
definition: Ultrafiltrering, membranfiltrering
status: valid
status modified: 2025-02-21
accepted date: 2025-02-21
in scheme: Reningssteg specificerade

UV-beh_Steg4_avanc
type: Concept
definition: UV-behandling, Steg 4. avancerad rening (kvartär)
status: valid
status modified: 2025-02-21
accepted date: 2025-02-21
in scheme: Reningssteg specificerade

UV-desinfekt
type: Concept
definition: UV-behandling, desinfektion
status: valid
status modified: 2025-02-21
accepted date: 2025-02-21
in scheme: Reningssteg specificerade

Vatmark_ej_N
type: Concept
definition: Våtmark efter utlopp (men ej nödvändig för att klara kvävereningskrav)
status: valid
status modified: 2025-02-21
accepted date: 2025-02-21
in scheme: Reningssteg specificerade

Vatmark_N
type: Concept
definition: Våtmark som används som en del av anläggningen för efterpolering (nödvändig för att klara kvävereningskrav)
status: valid
status modified: 2025-02-21
accepted date: 2025-02-21
in scheme: Reningssteg specificerade

Rotning_mesofil
type: Concept
definition: Mesofil rötning
status: valid
status modified: 2025-02-21
accepted date: 2025-02-21
in scheme: Reningssteg specificerade

Rotning_termofil
type: Concept
definition: Termofil rötning
status: valid
status modified: 2025-02-21
accepted date: 2025-02-21
in scheme: Reningssteg specificerade

Slambiokol_pyrolys
type: Concept
definition: Slambiokolstillverkning, pyrolys
status: valid
status modified: 2025-02-21
accepted date: 2025-02-21
in scheme: Reningssteg specificerade

Slambiokol_HTC
type: Concept
definition: Slambiokolstillverkning från hydrotermisk karbonisering
status: valid
status modified: 2025-02-21
accepted date: 2025-02-21
in scheme: Reningssteg specificerade

Slam_monoförbränning
type: Concept
definition: Monoförbränning av slam
status: valid
status modified: 2025-02-21
accepted date: 2025-02-21
in scheme: Reningssteg specificerade

SlamBeh_Urea
type: Concept
definition: Slam behandlat med urea
status: valid
status modified: 2025-02-21
accepted date: 2025-02-21
in scheme: Reningssteg specificerade

Slam_Langtidslagrad
type: Concept
definition: Slam som lagrats 6 månader eller längre
status: valid
status modified: 2025-02-21
accepted date: 2025-02-21
in scheme: Reningssteg specificerade

Reningsverk, belastning
type: ConceptScheme
notation: RV_BELASTN_TYP
is part of: Provdata Avlopp och Slam
registration status: Public draft
user modified: staffan
date modified: 2025-02-21 22:14:04.0
vocabulary type: Common
is numeric concept identifiers: false
is notations equal identifiers: false

DOM
type: Concept
definition: Belastning från bostäder
status: valid
status modified: 2025-02-21
accepted date: 2025-02-21
in scheme: Reningsverk, belastning

IND
type: Concept
definition: Industriell belastning
status: valid
status modified: 2025-02-21
accepted date: 2025-02-21
in scheme: Reningsverk, belastning

MIX
type: Concept
definition: Kombination av båda
status: valid
status modified: 2025-02-21
accepted date: 2025-02-21
in scheme: Reningsverk, belastning

Slamtyp
type: ConceptScheme
notation: SLAMTYP
is part of: Provdata Avlopp och Slam
registration status: Public draft
user modified: staffan
date modified: 2026-04-22 17:55:04.0
vocabulary type: Common
is numeric concept identifiers: false
is notations equal identifiers: false

Avloppsslam_avvattn
type: Concept
definition: Avvattnat avloppsslam
status: valid
status modified: 2025-03-14
accepted date: 2025-03-14
in scheme: Slamtyp

Avloppsslam_avvattn_ej_rotat
type: Concept
definition: Avvattnat avloppsslam, ej rötat
status: valid
status modified: 2025-03-14
accepted date: 2025-03-14
in scheme: Slamtyp

Avloppsslam_bioslam
type: Concept
definition: Bioslam
status: valid
status modified: 2025-03-14
accepted date: 2025-03-14
in scheme: Slamtyp

Avloppsslam_ospec
type: Concept
definition: Avloppsslam, ospecificerat
status: valid
status modified: 2025-03-14
accepted date: 2025-03-14
in scheme: Slamtyp

Dagvattenslam
type: Concept
definition: Dagvattenslam
status: valid
status modified: 2025-03-14
accepted date: 2025-03-14
in scheme: Slamtyp

Deponi
type: Concept
definition: Deponi
status: valid
status modified: 2025-03-14
accepted date: 2025-03-14
in scheme: Slamtyp

Externa_avlopp
type: Concept
definition: Externa avloppsfraktioner
status: valid
status modified: 2025-03-14
accepted date: 2025-03-14
in scheme: Slamtyp

Industrislam_ospec
type: Concept
definition: Industrislam, ospecificerat
status: valid
status modified: 2025-03-14
accepted date: 2025-03-14
in scheme: Slamtyp

Industrislam_spec
type: Concept
definition: Industrislam, specificerat, ange i fritextfältet
status: valid
status modified: 2025-03-14
accepted date: 2025-03-14
in scheme: Slamtyp

Kalkslam
type: Concept
definition: Kalkslam
status: valid
status modified: 2025-03-14
accepted date: 2025-03-14
in scheme: Slamtyp

Kemslam_fortjockat
type: Concept
definition: Förtjockat kemslam
status: valid
status modified: 2025-03-14
accepted date: 2025-03-14
in scheme: Slamtyp

Kompostslam
type: Concept
definition: Komposterat slam
status: valid
status modified: 2025-03-14
accepted date: 2025-03-14
in scheme: Slamtyp

Primarslam
type: Concept
definition: Primärslam - Försedimenterat avloppsslam
status: valid
status modified: 2025-03-14
accepted date: 2025-03-14
in scheme: Slamtyp

Rotslam
type: Concept
definition: Rötslam
status: invalid
status modified: 2025-03-29
not accepted date: 2025-03-29
in scheme: Slamtyp
editorial note: Använd : Rotslam_avvattn

Rotslam_avvattn
type: Concept
definition: Avvattnat rötslam - Avvattnat rötat avloppsslam
status: valid
status modified: 2025-03-14
accepted date: 2025-03-14
in scheme: Slamtyp

Rotslam_meso
type: Concept
definition: Rötslam mesofil rötning
status: valid
status modified: 2025-03-14
accepted date: 2025-03-14
in scheme: Slamtyp

Rotslam_meso_avattn
type: Concept
definition: Avvattnat rötslam mesofil rötning
status: valid
status modified: 2025-03-14
accepted date: 2025-03-14
in scheme: Slamtyp

Rotslam_termo
type: Concept
definition: Rötslam termofil rötning
status: valid
status modified: 2025-03-14
accepted date: 2025-03-14
in scheme: Slamtyp

Rotslam_termo_avattn
type: Concept
definition: Avvattnat rötslam termofil rötning
status: valid
status modified: 2025-03-14
accepted date: 2025-03-14
in scheme: Slamtyp

Slam_ospec
type: Concept
definition: Slam, ospecificerat
status: valid
status modified: 2025-03-14
accepted date: 2025-03-14
in scheme: Slamtyp

Slam_torkat_annan
type: Concept
definition: Torkat slam (annan)
status: valid
status modified: 2025-03-14
accepted date: 2025-03-14
in scheme: Slamtyp

Slam_torkat_term
type: Concept
definition: Termiskt torkat slam
status: valid
status modified: 2025-03-14
accepted date: 2025-03-14
in scheme: Slamtyp

Slam_trekammar
type: Concept
definition: Slam från trekammarbrunn
status: valid
status modified: 2025-03-14
accepted date: 2025-03-14
in scheme: Slamtyp

Slamaska_annan
type: Concept
definition: Aska från förbränning av bland annat avloppsslam
status: valid
status modified: 2025-03-14
accepted date: 2025-03-14
in scheme: Slamtyp

Slamaska_mono
type: Concept
definition: Aska från monoförbränning av avloppsslam
status: valid
status modified: 2025-03-14
accepted date: 2025-03-14
in scheme: Slamtyp

Slambiokol_HTC
type: Concept
definition: Slambiokol från hydrotermisk karbonisering
status: valid
status modified: 2025-03-14
accepted date: 2025-03-14
in scheme: Slamtyp

Slambiokol_pyrolys
type: Concept
definition: Slambiokol från pyrolys
status: valid
status modified: 2025-03-14
accepted date: 2025-03-14
in scheme: Slamtyp

Vattentyp för Avlopp och Slam
type: ConceptScheme
notation: VATTENTYP-AVLOPP_SLAM
is part of: Provdata Avlopp och Slam
registration status: Public draft
user modified: staffan
date modified: 2025-02-21 23:42:36.0
vocabulary type: Common
is numeric concept identifiers: false
is notations equal identifiers: false

AvloppsSpillVatten
type: Concept
definition: Avloppsvatten/spillvatten
status: valid
status modified: 2025-02-21
accepted date: 2025-02-21
in scheme: Vattentyp för Avlopp och Slam

Dagvatten
type: Concept
definition: Dagvatten
status: valid
status modified: 2025-02-21
accepted date: 2025-02-21
in scheme: Vattentyp för Avlopp och Slam

InkVattAvloppsv
type: Concept
definition: Inkommande vatten till avloppsreningsverk
status: valid
status modified: 2025-02-21
accepted date: 2025-02-21
in scheme: Vattentyp för Avlopp och Slam

Lakvatten
type: Concept
definition: Lakvatten
status: valid
status modified: 2025-02-21
accepted date: 2025-02-21
in scheme: Vattentyp för Avlopp och Slam

Lakvatten_obehandlat
type: Concept
definition: Lakvatten, obehandlat
status: valid
status modified: 2025-02-21
accepted date: 2025-02-21
in scheme: Vattentyp för Avlopp och Slam

Lakvatten_utgaende
type: Concept
definition: Lakvatten, utgående
status: valid
status modified: 2025-02-21
accepted date: 2025-02-21
in scheme: Vattentyp för Avlopp och Slam

Processvatten
type: Concept
definition: Processvatten, vatten som förekommer i och släpps ut från en industris processer
status: valid
status modified: 2025-02-21
accepted date: 2025-02-21
in scheme: Vattentyp för Avlopp och Slam

Recipient
type: Concept
definition: Recipient, ett vatten som mottar avlopps- eller dagvatten
status: valid
status modified: 2025-02-21
accepted date: 2025-02-21
in scheme: Vattentyp för Avlopp och Slam

Referens
type: Concept
definition: Referens
status: valid
status modified: 2025-02-21
accepted date: 2025-02-21
in scheme: Vattentyp för Avlopp och Slam

Slamvatten
type: Concept
definition: Slamvatten
status: valid
status modified: 2025-02-21
accepted date: 2025-02-21
in scheme: Vattentyp för Avlopp och Slam

UtgVattAvloppsv
type: Concept
definition: Utgående vatten från avloppsreningsverk
status: valid
status modified: 2025-02-21
accepted date: 2025-02-21
in scheme: Vattentyp för Avlopp och Slam

UtgVattVattenv
type: Concept
definition: Utgående vatten från vattenverk
status: valid
status modified: 2025-02-21
accepted date: 2025-02-21
in scheme: Vattentyp för Avlopp och Slam