Analysmetod
type: ConceptScheme
notation: ANALYS_MET
is part of: DATA MATVARDE
registration status: Public draft
user modified: staffan
date modified: 2025-08-26 15:43:34.0
vocabulary type: Common
is numeric concept identifiers: false
is notations equal identifiers: false

3500_Cr_B_Colorimetric_Method
type: Concept
definition: 3500-Cr B. Colorimetric Method. Standard Methods for the Examination of Water and Wastewater - This procedure measures only hexavalent chromium, (Cr6+). For total chromium determination, acid-digest the sample and follow with a suitable instrumental analysis technique. The hexavalent chromium is determined colorimetrically by reaction with diphenylcarbazide in acid solution. A red-violet colored complex of unknown composition is produced. The reaction is very sensitive
status: valid
status modified: 2025-08-25
accepted date: 2025-08-25
in scheme: Analysmetod

3500_Cr_B_Colorimetric_Method_2012
type: Concept
definition: 3500-Cr B. Colorimetric Method-2012 Standard Methods for the Examination of Water and Wastewater - This procedure measures only hexavalent chromium, (Cr6+). For total chromium determination, acid-digest the sample and follow with a suitable instrumental analysis technique. The hexavalent chromium is determined colorimetrically by reaction with diphenylcarbazide in acid solution. A red-violet colored complex of unknown composition is produced. The reaction is very sensitive
status: valid
status modified: 2025-08-25
accepted date: 2025-08-25
in scheme: Analysmetod

4_NP_EKV
type: Concept
definition: 4-NP-ekvivalenter: Summan av 4-NP med (4-NP faktor 1) + (4-NP-E01 faktor 0,83) + (4-NP-E02 faktor 0,71)
status: valid
status modified: 2025-08-25
accepted date: 2025-08-25
in scheme: Analysmetod

64_LFGB_L_00_00_115_2018_10_modifierad
type: Concept
definition: § 64 LFGB L 00.00-115:2018-10 (modifierad) (also: ASU L 00.00-115) Examination of foodstuffs - Determination of pesticide residues inplant-based foodstuffs - GC/MS and/or LC-MS/MS afteracetonitrile extraction/distribution and cleanup by dispersive SPE(QuEChERS) (Neufassung der Methode L 00.00-115 durch die Arbeitsgruppe "Pestizide" nach § 64 LFGB)
status: valid
status modified: 2025-08-25
accepted date: 2025-08-25
in scheme: Analysmetod

64_LFGB_L_00_00_34_2010_09
type: Concept
definition: § 64 LFGB L 00.00-34: 2010-09 Examination of food - Modular multimethod for determination of pesticide residues in foodstuff.(Modulare Multimethode zur Bestimmung vonPflanzenschutzmittelrückständen in Lebensmitteln(Erweiterte Neufassung der DFG-Methode S 19))
status: valid
status modified: 2025-08-25
accepted date: 2025-08-25
in scheme: Analysmetod

64_LFGB_L_06_00_3_modifierad
type: Concept
definition: §64 LFGB L 06.00-3 (modifierad) Determination of the mass of dry matter in meat and meat products - Gravimetric method - Reference method. (Untersuchung von Lebensmitteln - Bestimmung der Trockenmasse in Fleisch und Fleischerzeugnissen)
status: valid
status modified: 2025-08-25
accepted date: 2025-08-25
in scheme: Analysmetod

64_LFGB_L_10_00_9
type: Concept
definition: §64 LFGB L 10.00-9 Examination of food - Gas chromatographic determination of organotin compounds in fish and mussels (determination of mono, di, tri and tetrabutyltin, mono and dioctyltin, tricyclic hexyltin, mono, di and triphenyltin using GC-FPD in biota).Short method description:- Digestion with Tetramethylammonium hydroxide (TMAH)- Derivatisation with Natriumtetraethylborat (TEBOR)- Extraction with Hexane- Clean up- Measurement with GC-FPD (FPD = Flame Photometric Detector)
status: valid
status modified: 2025-08-25
accepted date: 2025-08-25
in scheme: Analysmetod

64_LFGB_L_17_00_4
type: Concept
definition: §64 LFGB L 17.00-4 Testing of foods - Determination of the total fat content in bread including biscuits of bread dough. (Untersuchung von Lebensmitteln - Bestimmung des Gesamtfettgehaltes in Brot einschließlich - Kleingebäck aus Brotteigen nach Säureaufschluss mittels Extraktion und Gravimetrie)Untersuchungsparameter: Fett, GesamtfettgehaltVerfahrensprinzipien: Säureaufschluss mittels Extraktion, Gravimetrie
status: valid
status modified: 2025-08-25
accepted date: 2025-08-25
in scheme: Analysmetod

ACES_BFR
type: Concept
definition: Bromanalys5 (ACES) - Brominated substances were analyzed on a GC using a 30 m x 0.25 mm, film thickness 0.25 µm TG5SilMS column connected to a mass spectrometer operating in electron capture negative ionization mode (NICI). Ammonia was used as the reaction gas and the mass fragments monitored were m/z 79 and 81 (Sellström et al., 1998)
status: valid
status modified: 2025-08-25
accepted date: 2025-08-25
in scheme: Analysmetod

ACES_CLC
type: Concept
definition: GC/ECD-PCB/OCP3 (ACES) - Chlorinated substances , e.g. PCBs (PCB-28, -52, -101, -118, -153, -138+163, -180), HCB, pp'-DDT ((1,1,1-trichloro-2,2-bis(4-chlorophenyl)ethane) and its breakdown products pp'-DDE ((1,1'-(2,2-Dichloro-1,1-ethenediyl)bis(4-chlorobenzene)) and pp'-DDD ((1,1'-(2,2-Dichloro-1,1-ethanediyl)bis(4-chlorobenzene)) as well as the insecticide γ-HCH (hexachlorocyclohexane, Lindane) and its α- and β-isomers were analyzed on a gas chromatograph equipped with two EC-detectors. Two fused capillary columns were used in parallel: 60 m x 0.25 mm, film thickness 0.25 µm TG5MS respectively DB1701. Helium was used as carrier gas and Argon/Methane as make-up gas (Eriksson et al. 1997)
status: valid
status modified: 2025-08-25
accepted date: 2025-08-25
in scheme: Analysmetod

ACES_PFAS
type: Concept
definition: UPLC-MS/MS (ACES) - Ultra performance liquid chromatography - tandem mass spectrometer - After extraction, the extract was transferred to an Eppendorf tube with ENVI-Carb and glacial acetic acid and vortex mixed. The extracts were centrifuged and transferred to a new Eppendorf tube. RSTD solution and NH4OAc in water was added. Extracts were warmed to room temperature, vortex mixed and centrifuged before transferred to auto sampler vial for UPLC-MS/MS analysis
status: valid
status modified: 2025-08-25
accepted date: 2025-08-25
in scheme: Analysmetod

ALDERSBEST_FISK
type: Concept
definition: Åldersbestämning av fisk. Metod baserad på ”Metodhandbok för åldersbestämning av fisk”, Instutitionen för akvatiska resurser, SLU
status: valid
status modified: 2025-08-25
accepted date: 2025-08-25
in scheme: Analysmetod

ALS_B_DFHMS02
type: Concept
definition: ALS B-DFHMS02 - ALS analysmetod för bestämning av polykorerade dibensodioxiner och dibensofuraner (PCDD och PCDF) i biota. Analys enligt US EPA 1613B och SS EN 16190 med HR GC-MS. "Determination of PCDD/Fs in enviro samples by isotope dilution method with the use of HRGC-HRMS. The procedure fulfils the conditions and requrements of the EPA 1613. Analysis includes spiking sample with 13C12 labeled extraction std., specific extraction method (toluen) by matrix ( including acid decomposition in the case of ash/slag samples), cleanup of a raw extract, fractionation and HRGC-HRMS measurement after addition of 13C12 labeled injection standard."
status: valid
status modified: 2025-08-25
accepted date: 2025-08-25
in scheme: Analysmetod

ALS_B_GCMS_10_GBA
type: Concept
definition: ALS B-GCMS-10/GBA - ALS analysmetod för bestämning av organofosfater och organofosfor-flamskyddsmedel i biota efter lösningsmedelsextraktion och mätning med GC-MS enligt PI-MA-M 03-079 2019-09. "Samples are cold-extracted with hexane, acetone and methyl-tert-butyl ether (MTBE). The extract is measured with GC-MSD."
status: valid
status modified: 2025-08-25
accepted date: 2025-08-25
in scheme: Analysmetod

ALS_B_PCBHMS02
type: Concept
definition: ALS B-PCBHMS02 - ALS analysmetod för bestämning av dioxinlika PCB-kongener i biota. Analys enligt metod baserad på US EPA 1668A och SS-EN 16190. Mätning utförs med GC-HRMS. TEQ beräknas som summa toxiska ekvivalenter enligt WHO 2005 alternativt I-TEQ. "Determination of indicator and dioxin-like PCBs in enviro samples by isotope dilution method with the use of HRGC-HRMS. SOP fullfills the conditions and requirements of the EPA 1668. Analysis includes spiking sample with 13C12 extraction std., specific extraction method by matrix, cleanup of a raw extract, fractionation and HRGC-HRMS measurement after addition of injection standard. Part of this procedure is moisture content determination in the case of solid samples."
status: valid
status modified: 2025-08-25
accepted date: 2025-08-25
in scheme: Analysmetod

ALS_B_PCBHMS04
type: Concept
definition: ALS B-PCBHMS04 - ALS analysmetod för bestämning av PCB i biota. Analys enligt metod baserad på US EPA 1668A och SS-EN 16190. Mätning utförs med GC-HRMS. TEQ beräknas som summa toxiska ekvivalenter enligt WHO 2005 alternativt I-TEQ. "Determination of indicator and dioxin-like PCBs in enviro samples by isotope dilution method with the use of HRGC-HRMS. SOP fullfills the conditions and requirements of the EPA 1668. Analysis includes spiking sample with 13C12 extraction std., specific extraction method by matrix, cleanup of a raw extract, fractionation and HRGC-HRMS measurement after addition of injection standard. Part of this procedure is moisture content determination in the case of solid samples."
status: valid
status modified: 2025-08-25
accepted date: 2025-08-25
in scheme: Analysmetod

ALS_GLYFOSAT_AMPA
type: Concept
definition: ALS: GLYFOSAT och AMPA - ALS analyspaket för bestämning av Glyfosat och Aminometylfosfonsyra (AMPA) i vatten. Analys utförs med LC-MS-MS
status: valid
status modified: 2025-08-25
accepted date: 2025-08-25
in scheme: Analysmetod

ALS_M4
type: Concept
definition: ALS-M4 - ALS analyspaket för bestämning av 10 metaller i biota med ICP-SFMS
status: valid
status modified: 2025-08-25
accepted date: 2025-08-25
in scheme: Analysmetod

ALS_OB_2
type: Concept
definition: ALS analyspaket OB-2a. Bestämning av PCB i biota med GC-MS
status: valid
status modified: 2025-08-25
accepted date: 2025-08-25
in scheme: Analysmetod

ALS_OB_3A
type: Concept
definition: ALS analyspaket OB-3a. Bestämning av klorerade pesticider i biota med GC-MS
status: valid
status modified: 2025-08-25
accepted date: 2025-08-25
in scheme: Analysmetod

ALS_OB_4A
type: Concept
definition: ALS-OB-4A - ALS analyspaket för bestämning av ftalater. Mätning utförs med GC-MS
status: valid
status modified: 2025-08-25
accepted date: 2025-08-25
in scheme: Analysmetod

ALS_OJ_19A3Q
type: Concept
definition: OJ-19a3Q Tennorganiska föreningar (3) (TBT låg rapp.gräns) i jord, slam och sediment. Bestämning av MBT, DBT, TBT. LOQ TBT=0,2 µg/kg TS. Analys enligt egen metod. Mätning med GC-ICP-SFMS
status: valid
status modified: 2025-08-25
accepted date: 2025-08-25
in scheme: Analysmetod

ALS_OJ_1_OXY_PAH
type: Concept
definition: ALS OJ-1 Oxy-PAH - ALS analyspaket för bestämning av 9 Oxy-PAH (9-Fluorenon, 9,10-Antrakinon, 2-Metylantrakinon, 4H-Cyklopenta[def]fenantren-4-on, Benso[a]fluorenon, Bensantron, Bens[a]antracen-7,12-dion, 5,12-Naftacenkinon, 6H-Benzo[cd]pyren-6-on) i jord, slam och sediment. Mätningen utförs med GC-MS
status: valid
status modified: 2025-08-25
accepted date: 2025-08-25
in scheme: Analysmetod

ALS_OJ_20C
type: Concept
definition: ALS Paket OJ-20C: Bestämning av oljeindex enligt metod CSN EN 14039 och TNRCC metod 1006. Mätning utförs med GC-FID.
status: valid
status modified: 2025-08-25
accepted date: 2025-08-25
in scheme: Analysmetod

ALS_OV-21A_SPIMFAB
type: Concept
definition: ALS Paket OV-21A: Bestämning av alifatfraktioner och aromatfraktioner. Bestämning av bensen, toluen, etylbensen och xylen (BTEX).Bestämning av polycykliska aromatiska kolväten, PAH (16 föreningar enligt EPA). Mätning utförs med GCMS enligt ALS interna instruktioner TKI74 och TKI41a som är baserade på SPIMFABs kvalitetsmanual.
status: valid
status modified: 2025-08-25
accepted date: 2025-08-25
in scheme: Analysmetod

ALS_OV_2A
type: Concept
definition: ALS Paket OV-2a: Bestämning av PCB7 i vatten enligt metod baserad på DIN 38407-3 och US EPA 8082. Mätning utförs med GC-ECD
status: valid
status modified: 2025-08-25
accepted date: 2025-08-25
in scheme: Analysmetod

ALS_OV_3D
type: Concept
definition: ALS analyspaket 3-d: Bestämning i vatten av Glyfosat och Aminometylfosfonsyra (AMPA). Analys utförs med LC-MS-MS
status: valid
status modified: 2025-08-25
accepted date: 2025-08-25
in scheme: Analysmetod

ALS_OV_PFAS_SPE
type: Concept
definition: ALS OV-PFAS-SPE - ALS analysmetod för bestämning av PFAS i vatten enligt US EPA 533. ISTD (intern standard) tillsätts provet som därefter upparbetas med fast-fas-extraktion (SPE), PFAS extraheras med MeOH (metanol) för att sedan indunstas och därefter injiceras provet på instrumentet (LC-MS-MS)
status: valid
status modified: 2025-08-25
accepted date: 2025-08-25
in scheme: Analysmetod

ALS_PRIO
type: Concept
definition: ALS interna metod för PRIO. Analys av PRIO-ämnen i ytvatten (Prioriterade ämnen enligt EU:s Water Frame Directive, WFD). Analys utförs med GC-MS, GC-MS-MS, GC-MS-MS-NCI eller LC-MS
status: valid
status modified: 2025-08-25
accepted date: 2025-08-25
in scheme: Analysmetod

ALS_PSO_1
type: Concept
definition: ALS analyspaket PSO-1 Bestämning i vatten av PAH (EPA-PAH, 15 st) med passiv provtagning och analys med HPLC-Fl/DAD och GC-MS. För bestämning av de tyngre PAHerna, används HPLC med fluorescens-detektor. För bestämning av de lättare PAHerna används GC-MS
status: valid
status modified: 2025-08-25
accepted date: 2025-08-25
in scheme: Analysmetod

ALS_PSO_11
type: Concept
definition: ALS analyspaket PSO-11 Bestämning i vatten av tributyltenn med passiv provtagning och analys med gaskromatograf med atomemissionsdetektor (GC_AED) enligt en modifiering av metoden: (EN ISO 17353 - Water quality — Determination of selected organotin compounds — Gas chromatographic method)
status: valid
status modified: 2025-08-25
accepted date: 2025-08-25
in scheme: Analysmetod

ALS_PSO_12
type: Concept
definition: ALS analyspaket PSO-12 Bestämning i vatten av nonylfenol och oktylfenol med passiv provtagning och analys med GC-MS-MS
status: valid
status modified: 2025-08-25
accepted date: 2025-08-25
in scheme: Analysmetod

ALS_PSO_2
type: Concept
definition: ALS analyspaket PSO-2 Bestämning i vatten av PCB 7 med passiv provtagning och analys med GC-ECD enligt en modifiering av metoden: (US EPA 1668 Determination of the toxic polychlorinated biphenyls (PCBs) in water, soil, sediment, sludge, tissue, and other sample matrices by isotope dilution and internal standard high-resolution gas chromatography/high-resolution mass spectrometry, HRGC/HRMS)
status: valid
status modified: 2025-08-25
accepted date: 2025-08-25
in scheme: Analysmetod

ALS_PSO_3
type: Concept
definition: ALS analyspaket PSO-3 Bestämning i vatten av klorerade pesticider med passiv provtagning och analys med GC-MS/MS
status: valid
status modified: 2025-08-25
accepted date: 2025-08-25
in scheme: Analysmetod

ALS_PSO_5
type: Concept
definition: ALS analyspaket PSO-5 Bestämning i vatten av bromerade flamskyddsmedel med passiv provtagning och analys med GC-MS/MS
status: valid
status modified: 2025-08-25
accepted date: 2025-08-25
in scheme: Analysmetod

ALS_SFA
type: Concept
definition: ALS interna metod för mätning av SFÄ. Analys av SFÄ, Särskilt Förorenande Ämnen i vatten enligt HaV (Havs och vattenmyndigheten). Analys utförs med GC-MS-MS, GC-MS-MS-NCI, LC-MS
status: valid
status modified: 2025-08-25
accepted date: 2025-08-25
in scheme: Analysmetod

ALS_S_AEOGMS01
type: Concept
definition: ALS S-AEOGMS01 - ALS analysmetod för bestämning av alkylfenoler och alkylfenoletoxylater enligt metod baserad på European Standard BT WI CSS99040. Mätning utförs med GC-MS eller GC-MS/MS. "Alkylphenols and alkylphenol ethoxylates are extracted from the sample by an acetone/n-hexane mixture. The extracts are derivatised with MSTFA (silanisation) and determined by the gas chromatography with mass detection. The method is based on document European Standard BT WI CSS99040. The mixture of isomers (nonylphenol and nonylphenol mono- and diethoxylates) are identified by the fingerprint method. The quantification of the method is based on external calibration with subsequent correction to yield of surrogate standard."
status: valid
status modified: 2025-08-25
accepted date: 2025-08-25
in scheme: Analysmetod

ALS_S_CLPGMS01
type: Concept
definition: ALS S-CLPGMS01 - ALS analysmetod för bestämning av klorfenoler i jord, slam och sediment enligt metod baserad på US EPA 8041, US EPA 3500 and DIN ISO 14154. Mätning utförs med GC-MS. "The method is based on extraction (acetone + hexane, K2CO3) of analytes from the sample into an organic solvent and a subsequent extraction into alkaline solution. Analytes in the alkaline solution are derivated to acetates that are subsequently transferred into non-polar organic solvent (hexane). The extract is analysed by gas chromatography with mass detection in SIM or GC-ECD regime. The quantification is performed by the method of internal standard with follow-up correction to yield of extraction standards."
status: valid
status modified: 2025-08-25
accepted date: 2025-08-25
in scheme: Analysmetod

ALS_S_DFHMS03A
type: Concept
definition: ALS S-DFHMS03A - ALS analysmetod för bestämning av polykorerade dibensodioxiner och dibensofuraner (PCDD och PCDF) i jord, slam och sediment. Analys enligt US EPA 1613B och SS EN 16190 med HR GC-MS. "Determination of PCDD/Fs in solid samples by isotope dilution method with the use of HRGC-HRMS. The procedure fulfils the conditions and requrements of the EPA 1613. Analysis includes spiking sample with 13C12 labeled extraction std., specific extraction method (toluen) by matrix ( including acid decomposition in the case of ash/slag samples), cleanup of a raw extract, fractionation and HRGC-HRMS measurement after addition of 13C12 labeled injection standard."
status: valid
status modified: 2025-08-25
accepted date: 2025-08-25
in scheme: Analysmetod

ALS_S_DFPCBHMS03A_CC
type: Concept
definition: ALS S-DFPCBHMS03A-CC - ALS analysmetod för beräkning av TEQ för dioxiner och furaner samt dioxinlika PCB (kongener) enligt US EPA 1668A och SS-EN 16190. Mätning utförs med GC-HRMS. TEQ beräknas som summa toxiska ekvivalenter enligt WHO 2005 alternativt I-TEQ
status: valid
status modified: 2025-08-25
accepted date: 2025-08-25
in scheme: Analysmetod

ALS_S_DRY_GRCI
type: Concept
definition: ALS S-DRY-GRCI - ALS analysmetod för bestämning av torrsubstans (TS) i jord, slam och sediment enligt metod baserad på CSN ISO 11465, CSN EN 12880 och CSN EN 14346:2007. "Determination of dry matter by gravimetry and determination of moisture by calculation from measured values. This method determines the mass fraction of dry matter, moisture and water content in solid samples. The sample is dried to a constant weight at 105°C and from the difference in weights before and after drying, we determine the mass fraction of dry matter."
status: valid
status modified: 2025-08-25
accepted date: 2025-08-25
in scheme: Analysmetod

ALS_S_CNT_CFA
type: Concept
definition: S-CNT-CFA - ALS analysmetod för bestämning av total cyanid i jord, slam och sediment med spektrofotometri enligt metod baserad på CSN 75 7415, CSN EN ISO 17380, CSN EN ISO 14403-2 och SM 4500 CN. "Determination of total cyanide by spectrophotometry and determination of complex-forming cyanides by calculation from measure values.The determination of total cyanide in solid matrices according to CSN EN ISO 17380, using continuous flow analysis with spectrophotometric detection, after releasing hydrogen cyanide in an acidic environment and separating it from the matrix by distillation. Thiocyanates are not included in total cyanides as there is no conversion to cyanides by CFA analysis. The determination of total cyanides (complex and free) is based on several reactions. Complex bound cyanides are decomposed by UV radiation with a wavelength of 312 nm at pH 3.8. Borosilicate spirals with a UV-B lamp prevent the conversion of thiocyanates to cyanides (filtering wavelengths smaller than 290 nm). The released cyanides are separated by distillation at 125°C and subsequently react with a solution of chloramine-T to form chlorkyan, which reacts with pyridine-4-carboxylic acid and 1,3-dimethylbarbituric acid to form a blue color. The absorbance of the colored solution is measured at a wavelength of 600 nm. The whole process is carried out using continuous flow analysis, which ensures the same conditions for distillation and the subsequent spectrophotometric measurement end of the entire analytical sequence."
status: valid
status modified: 2025-08-25
accepted date: 2025-08-25
in scheme: Analysmetod

ALS_S_CR6_IC
type: Concept
definition: ALS S-CR6-IC - ALS analysmetod för bestämning av Cr6+ i jord, slam och sediment efter alkalisk lakning enligt CSN EN 15192 och EPA 3060A. Mäning utförs med jonkromatografi. "Determination of hexavalent chromium by ion chromatography with spectrophotometric detection and trivalent chromium determination by calculation from measured values. Small amount of soil sample is leached by alkaline solution. Filtered leachate is cleaned from interferences on annex column IonPac AS7. The Cr(VI) is determined by spectrophotometry at 530 nm after post-column reaction with 1,5- diphenylcarbazide in acidic environment. In the post-column derivatisation, diphenylcarbazide reacts with Cr(VI), creating Cr(II) and diphenylcarbazone. The latter two compounds create a complex with characteristic purple colour."
status: valid
status modified: 2025-08-25
accepted date: 2025-08-25
in scheme: Analysmetod

ALS_S_DR_PFCLMS02
type: Concept
definition: ALS S-DR-PFCLMS02 - ALS analysmetod för bestämning av perflorerade och bromerade ämnen i jord, slam och sediment enligt metod baserad på DIN 38414-14. Mätningen utförs med LC-MS/MS. "Determination of perfluorinated and brominated compounds by liquid chromatography with MS/MS detection. Soil samples are homogenised before starting sample preparation. The analysed sample is pre-dried before its own extraction (method code S-PPHOM 40C). The PFCs are determined with use of ultra-effective liquid chromatography in connection with mass spectrometry and direct injection. The direct injection method means that concentration or clean-up steps are not included, only the marked extraction standard is added, pH is adjusted and mechanical particles are removed by centrifugation and filtration or dilution. 2 g of homogenised pre-dried sample are put into a 50 ml plastic bottle. Into the sample is added 100 µl of ISTD 20 ng/ml solution and the sample is allowed to stand for at least 10 minutes and 10 ml of ACN/MeOH (1:1, v/v), the bottle is closed and mixed and allowed to stand for 20 min. After this time, 10 ml of the ACN/MeOH mixture (1:1, v/v) is added, the bottle is closed, shaken and left to stand for at least 20 minutes. Next, the bottle is mixed on a tilting shaker for 10 min and centrifuged (11000 RPM, 20 °C, 5 min). 6 ml of the extract is taken from the bottle into a 15 ml plastic bottle with pre-weighed Envicarb (in the amount of 50 mg of Envicarb per 1 ml of extract; therefore, 0.3 g of Envicarb is used for 6 ml of extract), shaken and put on a multi-position vortex (2500 rpm., 2 minutes). Then the sample is centrifuged (10000 RPM, 20 °C, 5 min.) and 5 ml of the purified extract is collected in a plastic 15 ml bottle with a blue cap. This extract is concentrated to a volume of 1 ml with a gentle stream of N2 . 200 µl of the extract is taken from the test bottle into a 2 ml screw-top vial with 600 µl of 5 mM ammonium acetate, the vial is closed with a septa-less polyethy…
status: valid
status modified: 2025-08-25
accepted date: 2025-08-25
in scheme: Analysmetod

ALS_S_GCMSD_2_GBA
type: Concept
definition: ALS S-GCMSD-2/GBA - ALS analysmetod för bestämning av siloxaner enligt GBA:s interna metod. Mätningen utförs med GC-MS. "1 g of OS (original wet sample) are extracted with methyl-tert-butyl ether (MTBE) by ultrasonic treatment/shaker for 60 min. The extract is then measured on a GC-MS."
status: valid
status modified: 2025-08-25
accepted date: 2025-08-25
in scheme: Analysmetod

ALS_S_GCMS_15_GBA
type: Concept
definition: ALS S-GCMS-15/GBA - ALS analysmetod för bestämning av utvalda klorfenoler i jord, slam och sediment med GC-MS enligt DIN ISO 14154: 2005-12. "Samples are extracted with methanol using ultrasonic and shaking treatment. The extract is derivatised and measured with GC-MSD."
status: valid
status modified: 2025-08-25
accepted date: 2025-08-25
in scheme: Analysmetod

ALS_S_GCMS_1_GBA
type: Concept
definition: ALS S-GCMS-1/GBA - ALS analysmetod för bestämning av ftalater i jord, slam och sediment enligt DIN 19742: 2014-08. Mätning utförs med GC-MS. "Samples are extracted with ethylacetate on a shaker. The extract is measured with GC-MSD."
status: valid
status modified: 2025-08-25
accepted date: 2025-08-25
in scheme: Analysmetod

ALS_S_GCMS_5_GBA
type: Concept
definition: ALS S-GCMS-5/GBA - ALS analysmetod för bestämning av polybromerade difenyletrar i jord, slam och sediment enligt DIN EN ISO 22032: 2009-07. Mätningarna utförs med GC-MS. (DIN_EN_ISO_22032). "Samples are extracted with toluene using soxhlet or ultrasonic treatment. The extract is cleaned, concentrated and measured with GC-MSD."
status: valid
status modified: 2025-08-25
accepted date: 2025-08-25
in scheme: Analysmetod

ALS_S_GCMS_9_GBA
type: Concept
definition: ALS S-GCMS-9/GBA - ALS analysmetod för bestämning av organofosfater och organofosfor-flamskyddsmedel i jord, slam och sediment efter lösningsmedelsextraktion och mätning med GC-MS enligt PI-MA-M 03-079 2019-09. "Samples are extracted with acetone using ultrasonic and shaking treatment. The extract is measured with GC-MSD."
status: valid
status modified: 2025-08-25
accepted date: 2025-08-25
in scheme: Analysmetod

ALS_S_GC_36
type: Concept
definition: ALS S-GC-36 - ALS analysmetod för bestämning av metylkvicksilver i jord, slam och sediment med GC-ICP enligt SE-SOP-0026. "Spikning: Invägning 0.5g-3g och tillsätt spiklösning: Lakning av metylkvicksilver: Tillsätt kopparsulftat lösning och sedan kaliumbromid-lösning, skakas försiktigt och låt reagera. Extraktion av metylkvicksliver: Tillsätt diklormetan, skakas 1h. Separation av lösningsmedlet: Återextraktion av metylkvicksilver. Filtrering av slamprovextrakt. Bestämning med GC-ICP."
status: valid
status modified: 2025-08-25
accepted date: 2025-08-25
in scheme: Analysmetod

ALS_S_GC_46
type: Concept
definition: ALS S-GC-46 - ALS analysmetod för bestämning av tennorganiska föreningar (OTC) i jord, slam och sediment. Analys med GC-ICP-MS enligt SE-SOP-0036 (SS-EN ISO 23161:2018). "Icke torkade prover vägs in och lakas med en metanol/ättiksyra/H2O-blandning i ultraljudsbad. Sedan neutraliseras extraktionen med acetatbuffert samt natriumhydrixid. Efter det derivatiseras proverna i pentan m.h.a STEB (natriumtetraetylborat). Efter derivatiseringen tvättas pentanfasen och sedan sker analys på instrumentet."
status: valid
status modified: 2025-08-25
accepted date: 2025-08-25
in scheme: Analysmetod

ALS_S_LOI550
type: Concept
definition: ALS S-LOI550 - ALS analysmetod för bestämning av glödgningsförlust (GF) och glödgningrest (GR) i jord, slam och sediment vid 550°C enligt SE-SOP-0067 (SS-EN 15935:2021). "Determination of ash by gravimetry and calculation of loss on ignition from measure values. The dried samples are burned in the furnace at the specified temperature (550°C). From the difference in weight before and after burning, the loss on ignition is calculated, respectively the ignition residue."
status: valid
status modified: 2025-08-25
accepted date: 2025-08-25
in scheme: Analysmetod

ALS_S_OCPECD01
type: Concept
definition: ALS S-OCPECD01 - ALS analysmetod för bestämning av klorerade pesticider och polyklorerade bifeyler (PCB) i jord, slam och sediment enligt metod baserad på US EPA 8081 och ISO 10382. Mätningen utförs med GC-ECD. "Determination of organochlorine pesticides and other halogen compounds by gas chromatography method with ECD detection and calculation of organochlorine pesticides. Samples are extracted with acetone/hexane, cleaned by SPE (Florisil column) and mercury. After cleaning, the extract is concentrated. Individual OCPs are determinate by GC/ECD. The quantification is based on external calibration standard with correction of recovery of surrogate standard."
status: valid
status modified: 2025-08-25
accepted date: 2025-08-25
in scheme: Analysmetod

ALS_S_OCPECD04
type: Concept
definition: ALS S-OCPECD04 - ALS analysmetod för bestämning av klorerade pesticider och andra halogenerade ämnen i jord, slam och sediment enligt metod baserad på US EPA 8081 och ISO 10382. Mätningen utförs med GC-ECD. "Determination of organochlorine pesticides and other halogen compounds by gas chromatography method with ECD detection and calculation of organochlorine pesticides. Samples are extracted with acetone/hexane, cleaned by SPE (Florisil column) and mercury. After cleaning, the extract is concentrated. Individual OCPs are determinate by GC/ECD. The quantification is based on external calibration standard with correction of recovery of surrogate standard."
status: valid
status modified: 2025-08-25
accepted date: 2025-08-25
in scheme: Analysmetod

ALS_S_PCBHMS02A
type: Concept
definition: ALS S-PCBHMS02A - ALS analysmetod för bestämning av dioxinlika PC-kongener i jord, slam och sediment. Analys enligt metod baserad på US EPA 1668A och SS-EN 16190. Mätning utförs med GC-HRMS. TEQ beräknas som summa toxiska ekvivalenter enligt WHO 2005 alternativt I-TEQ. "Determination of indicator and dioxin-like PCBs in enviro samples by isotope dilution method with the use of HRGC-HRMS. SOP fullfills the conditions and requirements of the EPA 1668. Analysis includes spiking sample with 13C12 extraction std., specific extraction method by matrix, cleanup of a raw extract, fractionation and HRGC-HRMS measurement after addition of injection standard. Part of this procedure is moisture content determination in the case of solid samples."
status: valid
status modified: 2025-08-25
accepted date: 2025-08-25
in scheme: Analysmetod

ALS_S_PESLMS02
type: Concept
definition: ALS S-PESLMS02 - ALS analysmetod för bestämning av pesticider i jord, slam och sediment enligt CSN EN 15637 och US EPA 1694. Mätning utförs med LC-MS/MS. "Determination of pesticides, pesticide metabolites, drug residues and other pollutants by liquid chromatography method with MS/MS detection. Analytes are extracted from the sample using the QuEChERS method. The determination of pesticides is carried out by the method of liquid chromatography in conjunction with mass detection. The intensity of the decay of the mother ion into a daughter ion after the delivery of collision energy is monitored (multiple reaction monitoring, MRM). To confirm the result, two MRM transitions No. SANTE/11813/2017 are monitored for each analyte), a positive result is considered one when the ratio between the transitions corresponds to the ratio of the transitions in the standard. Quantification is performed using an external standard. The results are corrected for the yield of internal standards (external or internal calibration) and/or for the yield of the fortified blank."
status: valid
status modified: 2025-08-25
accepted date: 2025-08-25
in scheme: Analysmetod

ALS_S_PFCLMS02
type: Concept
definition: ALS S-PFCLMS02 - ALS analyspaket för bestämning av perfluorerade ämnen enligt metod baserad på DIN 38414-14. Provet homogeniseras innan upparbetning och analyseras med LC-MS/MS
status: valid
status modified: 2025-08-25
accepted date: 2025-08-25
in scheme: Analysmetod

ALS_S_SFMS_16
type: Concept
definition: ALS S-SFMS-16 - ALS analyspaket för bestämning av metaller i fasta matriser enligt SS-EN ISO 17294-2:2016 och US EPA 200.8 (1994). Uppslutning av prov sker enligt ALS-metod S-PA 16-HB och analys utförs med ICP-SFMS
status: valid
status modified: 2025-08-25
accepted date: 2025-08-25
in scheme: Analysmetod

ALS_S_SFMS_49
type: Concept
definition: ALS S-SFMS-49 - ALS analyspaket för bestämning av metaller i fasta matriser enligt SS-EN ISO 17294-2:2016 och US EPA 200.8 (1994). Uppslutning av prov sker enligt ALS-metod S-PS49-FU och analys utförs med ICP-SFMS
status: valid
status modified: 2025-08-25
accepted date: 2025-08-25
in scheme: Analysmetod

ALS_S_SFMS_59
type: Concept
definition: ALS S-SFMS-59 - ALS analyspaket för bestämning av metaller i jord, slam, sediment och byggnadsmaterial enligt SS-EN ISO 17294-2:2016 och US EPA 200.8 (1994). Uppslutning av prov sker enligt ALS-metod S-PM59-HB och analys utförs med ICP-SFMS
status: valid
status modified: 2025-08-25
accepted date: 2025-08-25
in scheme: Analysmetod

ALS_S_SPIGMS04
type: Concept
definition: S-SPIGMS04 - ALS analysmetod för bestämning av organiska föreningar i i jord, slam och sediment. Analys av organiska föroreningar-alifater >C5-C16 med GC-MS metod enligt SPIMFAB:s kvalitetsmanual
status: valid
status modified: 2025-08-25
accepted date: 2025-08-25
in scheme: Analysmetod

ALS_S_TOC1_IR
type: Concept
definition: ALS S-TOC1-IR - ALS analysmetod för bestämning av TOC i jord, slam och sediment enligt direkt metod; CSN ISO 10694, CSN EN 13137:2002, CSN EN 15936. "Determination of total carbon (TC), total organic carbon (TOC) by the combustion method with IR detection and calculation of total inorganic carbon (TIC), carbonates and organic matter from measured values. Determination of TOC in solid samples after thermal decomposition with IR detection. The determination is performed on an analyzer Elementar soli TOC cube (M-1143). Analytical sample is weighed into porcelain cups and HCl (1: 1) is added to remove TIC (total inorganic carbon). The cup is dried in an oven at 70 °C. Then, the TOC is determined by IR detector."
status: valid
status modified: 2025-08-25
accepted date: 2025-08-25
in scheme: Analysmetod

ALS_S_TPHFID01
type: Concept
definition: ALS S-TPHFID01 - ALS analysmetod för bestämning av oljeindex i jord, slam och sediment enligt metod CSN EN 14039, CSN EN ISO 16703, CSN P CEN ISO/TS 16558-2, US EPA 8015, US EPA 3550 och TNRCC metod 1006. Mätning utförs med GC-FID. " Determination of extractable compounds in the range of hydrocarbons C10 - C40, their fractions calculated from the measured values by gas chromatography method with FID detection. A sample is extracted with acetone/hexane. The extract is decanted through sodium sulfate and cleaned up through silicagel because of elimination of polar compounds. After cleaning, the extract is concentrated or diluted. The quantification is based on external calibration standard."
status: valid
status modified: 2025-08-25
accepted date: 2025-08-25
in scheme: Analysmetod

ALS_UK_BISPHENOL_A_GEO91
type: Concept
definition: ALS UK-geo91 Analysis of Bisphenol A in Surface Water, Groundwater and Saline Water. The method is a direct aqueous injection (DAI) procedure. Samples are analysed by highperformance liquid chromatography using a triple quadrupole mass spectrometer detector. Samples are injected on to a HPLC analytical column and analytes are separated from matrix interference. Analytes are identified and quantified with mass spectrometric detection in SRM mode. Quantitation is by an internal standard procedure. ALS Environmental, Torrington Avenue, Coventry, CV4 9GU, United Kingdom
status: valid
status modified: 2025-08-25
accepted date: 2025-08-25
in scheme: Analysmetod

ALS_S_SMLGMS01
type: Concept
definition: ALS S-SMLGMS01 CZ_SOP_D06_03_181 (US EPA 429, US EPA 1668, US EPA 3550) - ALS analysmetod för bestämning av semivolatila organiska ämnen i jord, slam och sediment med isotoputspädning och gaskromatografi med masspektrometri. Summor beräknas från uppmätta värden. Metoden har modifierats inom omfattningen för den flexibla ackrediteringen angiven i Annex to the Certificate of Accreditation No . 468/2020 utfärdad 27 juli 2020. Parametrar som inte ingår i bilagan till ackrediteringscertifikatet i parameter översikten under index 27 har lagts till. "Determination of semi-volatile organic compounds by gas chromatography method with MS and calculation of semi-volatile organic compounds sums from measured values. The principle of the method is the microwave extraction of analytes from a sample of freeze-dried sea or river sediment into an organic solvent. The portion of the organic extract is concentrated and directly dosed into the gas chromatograph, where the analytes are separated on the chromatographic column and their detection is performed by a mass detector in the MRM (Multiple Reaction Monitoring) mode. Quantification is performed using the internal (extraction) standard method. The internal standard extraction method is classified according to EPA 8000C as a hybrid between the internal standard method and the isotopic dilution method. (http://www.epa.gov/osw/hazard/testmethods/pdfs/8000c_v3.pdf). An extraction (internal) standard is added into the freeze-dried philized sediment sample before extraction, which is otherwise commonly used as an internal standard added into extracts prior to injection into the gas chromatograph. These are either deuterated analogues of the target analytes, or substances very similar to the target analytes that do not occur in freeze dried sediment samples. These internal standards are also added in the same amount to the calibration solutions, and a calibration curve is constructed as a function of the ratio of the concentrations of the…
status: valid
status modified: 2025-08-25
accepted date: 2025-08-25
in scheme: Analysmetod

ALS_S_SMLGMS02
type: Concept
definition: S-SMLGMS02 - ALS analysmetod för bestämning och beräkning av semivolatila organiska ämnen i i jord, slam och sediment. Analys av PAH-16 och PCB-7 med isotoputspädning enligt US EPA 429, US EPA 1668, US EPA 3550. Mätning utförs med GC-MS. "The principle of the method is the microwave extraction of analytes from a sample of freeze-dried sea or river sediment into an organic solvent (acetone+hexane, the final extract is in hexane). The portion of the organic extract is concentrated and directly dosed into the gas chromatograph, where the analytes are separated on the chromatographic column and their detection is performed by a mass detector in the MRM (Multiple Reaction Monitoring) mode. Quantification is performed using the internal (extraction) standard method. The internal standard extraction method is classified according to EPA 8000C as a hybrid between the internal standard method and the isotopic dilution method (http://www.epa.gov/osw/hazard/testmethods/pdfs/8000c_v3.pdf). An extraction (internal) standard is added into the freeze-dried philized sediment sample before extraction, which is otherwise commonly used as an internal standard added into extracts prior to injection into the gas chromatograph. These are either deuterated analogues of the target analytes, or substances very similar to the target analytes that do not occur in freeze dried sediment samples. These internal standards are also added in the same amount to the calibration solutions, and a calibration curve is constructed as a function of the ratio of the concentrations of the target analyte and the internal standard (x-axis) to the ratio of the responses of the target analyte and the internal standard (y-axis). The amount of analyte in the sample is calculated using the evaluation software MassHunter."
status: valid
status modified: 2025-08-25
accepted date: 2025-08-25
in scheme: Analysmetod

ALS_S_SMVGMS05
type: Concept
definition: ALS S-SMVGMS05 Bestämning av semivolatila organiska föreningar med gaskromatografi med MS eller MS/MS samt beräkning av semivolatila föreningar och summor enligt US EPA 8270D, US EPA 8082A, CSN EN 15527, ISO 18287, ISO 10382, CSN EN 15308 och provberedning enligt US EPA 3546. "Determination of semi volatile organic compounds by gas chromatography method with MS and calculation of semi volatile organic compounds sums from measured values. The determination of the content of extractable semi-volatile organic substances in waters (leaches) and solid samples by the method of gas chromatography with MS detection. The determination of semi-volatile substances is based on the US EPA 8082A method. The principle of the method is the extraction of semi-volatile organic substances from soil and water samples (leachates) into the appropriate solvent. After purification and concentration, the extract is dosed into a gas chromatograph, where analytes are separated on a chromatographic column. Their identification and detection is carried out by a mass detector. Quantification is performed using the external standard method followed by correction for the yield of the internal standard or is performed using the internal standard extraction method."
status: valid
status modified: 2025-08-25
accepted date: 2025-08-25
in scheme: Analysmetod

ALS_UK_EM_ORG_CONT_GEO83
type: Concept
definition: ALS UK-geo83 Analysis of Emerging Organic Contaminants for the EU water framework directive - Saline, Ground and Surface Waters. The compounds of interest are extracted from an aqueous matrix via Agilent’s online SPE system, equipped with a Hypersil Gold aQ pre-concentration column. The compounds are then flushed from the pre-concentration column via a gradient run and are separated on an Agilent Eclipse Plus C18 RRHD 3.0x55mm, 1.8um analytical column, before being ionised by Agilent’s Jetstream Electrospray technology, and analysed using MRM transitions on an Agilent 6470 LCMSMS. ALS Environmental, Torrington Avenue, Coventry, CV4 9GU, United Kingdom
status: valid
status modified: 2025-08-25
accepted date: 2025-08-25
in scheme: Analysmetod

ALS_UK_HORMONES
type: Concept
definition: ALS UK Hormones: Determination of hormones in water. The compounds of interst are extracted from filtered aqueous matrix by solid phase extraction (SPE) and the extracts are further cleaned up by means of of another SPE procedure utilising a cartridge with a molecular imprinted polymer (MIP) stationary phase that has a class selective affinity for steroidal oestrogens. The isolated determinands are then derivatised with pentafluorobenzoyl chloride (PFBCI) and MSTFA and analysed by GC-MS-MS with negative chemical ionisation (NCI) using methane as the reagent gas. Quantification is based upon an internal standardisation procedure. ALS Environmental, Torrington Avenue, Coventry, CV4 9GU, United Kingdom
status: valid
status modified: 2025-08-25
accepted date: 2025-08-25
in scheme: Analysmetod

ALS_UK_OCTYL_NONYLPHENOLS_GEO84
type: Concept
definition: ALS UK-geo84 Analysis of Octyl and Nonylphenols and their ethoxylates in Ground, Saline and Surface Waters. An automated extraction procedure is used to simultaneously extract the target compounds from aqueous matrix into hexane and derivatise them with Pentafluorobenzoyl Chloride to form the electron capturing Pentafluorobenzoyl derivatives. The extract is then analysed by GC-MSMS with negative chemical ionisation (NCI) using methane as the reagent gas. Quantification is based upon an internal standardisation procedure. ALS Environmental, Torrington Avenue, Coventry, CV4 9GU, United Kingdom
status: valid
status modified: 2025-08-25
accepted date: 2025-08-25
in scheme: Analysmetod

ALS_S_SPIGMS03
type: Concept
definition: S-SPIGMS03 - ALS analysmetod för bestämning i jord, slam och sediment av: 1) Alifatfraktioner och aromatfraktioner. 2) Polycykliska aromatiska kolväten, PAH (16 föreningar enligt EPA). 4) Summa metylpyrener/metylfluorantener och summa metylkrysener/metylbens(a)antracener. GC-MS metod enligt SPIMFAB:s kvalitetsmanual. "After addition of extraction standard, the sample is extracted with a pentane-methanol mixture with the final extract in pentane. After shaking with acidified water, the organic phase is isolated and analyzed by capillary gas chromatography with mass detection, when spectra are recorded in SIM or SIM/SCAN mode. Quantification is performed by the external standard method followed by corrections to the recovery of the extraction standard."
status: valid
status modified: 2025-08-25
accepted date: 2025-08-25
in scheme: Analysmetod

ALS_S_SPIHSP01
type: Concept
definition: ALS S-SPIHSP01 - ALS analysmetod för bestämning av volatila alifatiska och aromatiska kolväten i i jord, slam och sediment. Analys utförs med Headspace-GC-MS metod enligt SPIMFABs kvalitetsmanual. "The weight of the sample is extracted with methanol in a closed vial after the adding of the surrogate standard and internal standards. An aliquot portion of the methanol extract is dosed into a HS vial, in which a defined volume of reagent water (15 ml) is presented and the vial is closed with a lid. The vial is incubated at a defined temperature and time. Vapors of volatile organic compounds are injected into a chromatographic column after the liquid-vapor interphase balance has been established, where they are separated. The separated compounds are identified by mass detector after recording spectra in SIM mode in the range of 35-200 amu. Quantification is performed by comparing the responses of identified substances in the sample and external standards followed by corrections to the response of internal standards."
status: valid
status modified: 2025-08-25
accepted date: 2025-08-25
in scheme: Analysmetod

ALS_S_VOCGMS01
type: Concept
definition: S-VOCGMS01 - ALS analysmetod för bestämning av volatila organiska föreningar i i jord, slam och sediment: 1) BTEX. 2) Halogenerade volatila organiska föreningar. 2) Ickehalogenerade volatila organiska föreningar. Analysen utförs enligt metod baserad på US EPA 8260, US EPA 5021A, US EPA 5021, US EPA 8015, CSN EN ISO 22155, CSN EN 15009, CSN EN ISO 16558-1 och MADEP 2004, utgåva 1.1. Mätningen utförs med GC-FID och GC-MS. "Solid sample is extracted into methanol in a closed vial. An aliquote part of the methanol extract is added to a headspace vial with a pre-defined amount of reagent water. The vial is incubated for the defined time and temperature. After establishing the liquid-gas equilibrium, the vapours of volatile organic compounds are injected to chromatographic column where they are separated. Separated compounds are identified in mass spectrometer and quantified in detector, based on the response magnitude of the amount of substance."
status: valid
status modified: 2025-08-25
accepted date: 2025-08-25
in scheme: Analysmetod

ALS_S_VOCGMS04
type: Concept
definition: S-VOCGMS04 - ALS analysmetod för bestämning av flyktiga organiska föreningar i i jord, slam och sediment: Analys av: 1) Naftalen. 2) +Halogenerade volatila organiska föreningar. 3) Ickehalogenerade volatila organiska föreningar. Metod baserad på US EPA 8260, US EPA 5021A, US EPA 5021, US EPA 8015, CSN EN ISO 22155, CSN EN ISO 15009, CSN EN ISO 16558-1, MADEP 2004, rev. 1.1. Mätningen utförs med GC/MS och GC/FID. "Solid sample is extracted into methanol in a closed vial. An aliquote part of the methanol extract is added to a headspace vial with a pre-defined amount of reagent water. The vial is incubated for the defined time and temperature. After establishing the liquid-gas equilibrium, the vapours of volatile organic compounds are injected to chromatographic column where they are separated. Separated compounds are identified in mass spectrometer and quantified in detector, based on the response magnitude of the amount of substance."
status: valid
status modified: 2025-08-25
accepted date: 2025-08-25
in scheme: Analysmetod

ALS_UK_ORGANO_Cl_P_N_GEO47
type: Concept
definition: ALS UK-geo47 Determination of a wide range of organochlorine, organophosphorous and organonitrogen compounds in Ground waters, Surface waters, Treated Sewage effluents, Trade effluents and Landfill leachates. A wide range of organic compounds are isolated from aqueous matrix using a two stage extraction technique. The compounds are determined by Electron impact GC-MSMS in selected reaction monitoring (SRM) mode using argon as a collision gas. ALS Environmental, Torrington Avenue, Coventry, CV4 9GU, United Kingdom
status: valid
status modified: 2025-08-25
accepted date: 2025-08-25
in scheme: Analysmetod

ALS_UK_PAH_EPA16_GEO81
type: Concept
definition: ALS UK-geo81 Determination of PAH compounds (EPA16) in environmental waters - Surface Water, Land Leachate, Groundwater, Untreated Sewage, Treated Sewage and Trade Effluent. An automated dispersive liquid/liquid microextraction procedure (DLLME) is used to extract the PAH compounds from aqueous matrix. The dispersive solvent is a 1 % solution of toluene in isopropanol and the extraction solvent is a mixture of dichloromethane and n-pentane (80:20). The extract is then quantified by gas chromatography with mass spectrometric detection (GCMS). ALS Environmental, Torrington Avenue, Coventry, CV4 9GU, United Kingdom
status: valid
status modified: 2025-08-25
accepted date: 2025-08-25
in scheme: Analysmetod

ALS_UK_PEST_NONPOLAR_ORG_GEO78
type: Concept
definition: ALS UK-geo78 Analysis of Trace level Pesticides and selected non-polar organic compounds in Surface, Ground and Saline waters, Final effluents (TBT only). Approximately 400mls of sample is treated with sodium tetraethylborate (STEB) to ethylate TBT cation and is then extracted with 20mls of iso-hexane. The extract is analysed by GC-MSMS with electron impact (EI) ionisation. ALS Environmental, Torrington Avenue, Coventry, CV4 9GU, United Kingdom
status: valid
status modified: 2025-08-25
accepted date: 2025-08-25
in scheme: Analysmetod

ALS_W_LCMS_MS_2_HUM
type: Concept
definition: ALS W-LCMS-MS-2/HUM - ALS analysmetod för bestämning i vatten av ultrakorta perfluorerade ämnen, PFAS (5) i vatten. MeOH (metanol) och ISTD (intern standard) tillsätts provet som därefter injiceras direkt på instrumentet. Analys sker med LC-MS/MS
status: valid
status modified: 2025-08-25
accepted date: 2025-08-25
in scheme: Analysmetod

ALS_W_PESLMS04.
type: Concept
definition: ALS W-PESLMS04 - ALS analysmetod för bestämning i vatten av fenoxisyror och andra herbicider. Analys utförs enligt CZ SOP D06 03 182.A (DIN 38407-35, CEN/TS 15968). Mätningen utförs med LC-MS/MS
status: valid
status modified: 2025-08-25
accepted date: 2025-08-25
in scheme: Analysmetod

ALS_W_RN222LSC
type: Concept
definition: ALS W-RN222LSC - ALS analysmetod för bestämning av radon 222 enligt CSN 75 7625 (nukleär instrumenteringsräknare som utnyttjar flytande scintillatorer)
status: valid
status modified: 2025-08-25
accepted date: 2025-08-25
in scheme: Analysmetod

ALS_W_SFMS_5ALK
type: Concept
definition: ALS W-SFMS-5ALK - ALS analysmetod för bestämning av halogener i sötvatten med ICP-SFMS enligt SS-EN ISO 17294-2:2023 och US EPA 200.8:1994
status: valid
status modified: 2025-08-25
accepted date: 2025-08-25
in scheme: Analysmetod

ALS_W_SFMS_5A_In
type: Concept
definition: ALS W-SFMS-5A-In - ALS analysmetod för analys av Indium (In) i sötvatten med ICP-SFMS enligt SS-EN ISO 17294-2:2023 och US EPA Method 200.8:1994. Provet är surgjort med 5 ml HNO3 (suprapur) per 100 ml före analys
status: valid
status modified: 2025-08-25
accepted date: 2025-08-25
in scheme: Analysmetod

ALS_W_SFMS_SO2_WFD
type: Concept
definition: ALS W-SFMS-SO2-WFD - ALS analysmetod för analys av grundämnen i grundvatten (WFD grundvattendirektiv 2021) med ICP-SFMS enligt SS-EN ISO 17294-2:2023 och US EPA Method 200.8:1994
status: valid
status modified: 2025-08-25
accepted date: 2025-08-25
in scheme: Analysmetod

ALS_W_SMVGMS02
type: Concept
definition: ALS W-SMVGMS02 - ALS analysmetod för bestämning i vatten av klorerade organiska insekticider, polyklorerade bifenyler och klorbensener. Analys utförs enligt SS-EN 6468, US EPA 8270D, US EPA 8082A och US EPA 8000. Mätning utförs med GC-MS
status: valid
status modified: 2025-08-25
accepted date: 2025-08-25
in scheme: Analysmetod

ALS_UK_PFAS_PEST_PHTAL_GEO82
type: Concept
definition: ALS UK-geo82 Analysis of Chloridazon, Bentazone, Metribuzin, Atrazine, Isoproturon, Diuron, Dichlorprop-p, Mecoprop,Pentachlorophenol, PFOS (Heptadecafluorooctanesulfonic acid), PFOA (Perfluoroctanoic acid) and DEHP (Diethylhexyl phthalate) in Surface, Ground and Saline waters. The compounds of interest are extracted from an aqueous matrix via online SPE, utilising Thermo Scientific’s EQuan LC system, equipped with a Hypersil Gold aQ pre-concentration column. The compounds are then backflushed from the pre-concentration column via a gradient run and are quantified by high resolution, accurate mass (HRAM) liquid chromatography mass spectrometry (LC-MS). ALS Environmental, Torrington Avenue, Coventry, CV4 9GU, United Kingdom
status: valid
status modified: 2025-08-25
accepted date: 2025-08-25
in scheme: Analysmetod

ALS_UK_VOC_GEO76
type: Concept
definition: ALS UK-geo76 Analysis of Volatile organic compounds (VOCs) by headspace in Ground waters, surface waters, landfill leachates and sewage and trade effluents. A 10 ml aliquot of water sample, preserved to pH<2 with HCl, is placed in a septum vial together with 1 ml of a sodium chloride based matrix modifying solution and allowed to equilibrate with its headspace vapour at 90°C. A sample of the vapour is injected using an automatic headspace sampler into a capillary column gas chromatograph (GC), the volatile organic compounds are separated and then identified and quantified using a mass spectrometer (MSD) simultaneously operating in selected ion monitoring (SIM) and full scan modes. ALS Environmental, Torrington Avenue, Coventry, CV4 9GU, United Kingdom
status: valid
status modified: 2025-08-25
accepted date: 2025-08-25
in scheme: Analysmetod

ALS_W_PESLMS07
type: Concept
definition: ALS W-PESLMS07 - ALS analysmetod för bestämning i vatten av pesticider, pesticidmetaboliter, läkemedelsrester och andra föroreningar. Analys utförs enligt CZ SOP D06 03 183.A (US EPA 535, US EPA 1694) genom vätskekromatografi med MS/MS-detektion och beräkning av pesticider, pesticidmetaboliter, läkemedelsrester och andra föroreningar summerade från uppmätta värden. Metoden har ändrats inom en flexibelt omfattande ackreditering, se ackrediteringsbevis nr 610/2017 daterad 16 oktober 2017. Det hänvisar till parametrarna: 2-amino-4-metoxi-6-metyl-1, 3,5-triazin, 3,5,6-triklorpyridin-2-ol, dimetaklor-CGA 369873, dimetenamid-ESA, dimetenamid-OA, flufenacet, flufenacet-ESA, flufenacet-OA, flutriafol, jodosulfuron-metyl, isoxaflutol, isoxaflutoldiketonitril, petoxamid-ESA, propazin-2-hydroxy, metolachlor-CGA 368208, metolachlor-NOA 413173, trietazin
status: valid
status modified: 2025-08-25
accepted date: 2025-08-25
in scheme: Analysmetod

ANALYTICA_BF
type: Concept
definition: ANALYTICA-BF. Bestämning av bisfenol med gaskromatografi-masspektrometri (GC-MSD), med Selected Ion Monitoring (SIM mode), där en CPSIL 8 CB MS-kolonn eller CPSIL 5 CB MS-kolonn användes. Slutligen utfördes en kvantifiering med extern standard
status: valid
status modified: 2025-08-25
accepted date: 2025-08-25
in scheme: Analysmetod

AOAC_2008_06
type: Concept
definition: AOAC Official Method 2008.06, AOAC INTERNATIONAL. Determination of moisture and fat in meats [Applicable for the determination of moisture and fat in meat and meat products (fresh, finished products and emulsions of beef, pork,and poultry).]. Microwave and Nuclear Magnetic Resonance Analysis
status: valid
status modified: 2025-08-25
accepted date: 2025-08-25
in scheme: Analysmetod

AR_EcoScreen
type: Concept
definition: AR-EcoScreen: Effektbaserad analys av AR (androgenreceptor)-aktivitet och anti-AR-aktivitet med luciferas gen-expression i celler från cellinjen AR-EcoScreen med ovarie-ursprung från kinesisk dvärghamster (Cricetulus griseus). Används i biotest för bestämning av AR-aktivitet och anti-AR-aktivitet.Cellinjen är stabilt transfekterad med den humana AR-receptorn samt en luciferas-reportergen. Mätbart ljus emitteras i respons till AR-aktivitet och anti-AR-aktivitet och detekteras av spektrofotometer
status: valid
status modified: 2025-08-25
accepted date: 2025-08-25
in scheme: Analysmetod

AZUR_ENV_1998
type: Concept
definition: Azur environmental-1998. The Microtox® acute basic, DIN, ISO and wet test procedures. Azur Environmental, Carlsbad, CA, USA, 1998
status: valid
status modified: 2025-08-25
accepted date: 2025-08-25
in scheme: Analysmetod

AbfKlärV
type: Concept
definition: AbfKlärV Sewage sludge ordinance - the present Ordinance implements the Council Directive 86/278/EEC of 12 June 1986 on the protection of the environment and, in particular, of the soils where sewage sludge is, used in agriculture (Official Journal of the EC, no. L 181 p. 6). The said Ordinance has to be observed by anyone who 1. operates waste-water treatment plants and surrenders or intends to surrender sewage sludge for application on agriculturally or horticulturally used soils, 2. applies or intends to apply sewage sludge on agriculturally or horticulturally used soils. It consists of Sections as follows: Scope (1); Definition of terms (2); Conditions permitting application (3); Application bans and restrictions (4); Exemption regulations (5); Application quantity (6); Obligations to furnish verification (7); Application Schedule (8); Administrative offences (9); Entry into Force, abrogation (10). Two Annexes are enclosed. (Verordnung über die Verwertung von Klärschlamm, Klärschlammgemisch und Klärschlammkompost (Klärschlammverordnung - AbfKlärV)
status: valid
status modified: 2025-08-25
accepted date: 2025-08-25
in scheme: Analysmetod

AhR_DR_EcoScreen
type: Concept
definition: AhR-DR-EcoScreen: Effektbaserat test av AhR (arylhydrokarbonreceptor/även kallad dioxinreceptor)-aktivitet med luciferas gen-expression i celler från cellinjen DR-EcoScreen från muslever-hepatom. Används i biotest för bestämning av polyklorerade dibenso-p-dioxiner (PCDD), polyklorerade dibensofuraner (PCDF) och dioxin-lika polyklorerade bifenyler (dl-PCB) i miljöprov och livsmedel. Cellinjen är stabilt transfekterad med mus-AhR(DR)-receporn samt en luciferas-reportergen. Mätbart ljus emitteras i respons till AhR-aktivitet och detekteras av spektrofotometer
status: valid
status modified: 2025-08-25
accepted date: 2025-08-25
in scheme: Analysmetod

Aquaref_MA_12
type: Concept
definition: Aquaref MA 12 Bestämning av hormoner i vatten (Etinylöstradiol (CAS: 57-63-6) 17-beta-Östradiol (CAS: 50-28-2) Östron (CAS: 53-16-7) Östriol (CAS: 50-27-1). Upparbetning med fast-fas-extraktion (SPE) följt av analys med vätskekromatograf med tandem masspektrometer (LC-MS-MS). https://www.aquaref.fr/system/files/Aquaref_2013_D1b_Irstea_MA12-Hormone_estrogeniques_phase_dissoute_VF.pdf
status: valid
status modified: 2025-08-25
accepted date: 2025-08-25
in scheme: Analysmetod

BLV_L_00_00_12
type: Concept
definition: BLV L 00.00-12 Untersuchung von Lebensmitteln; Bestimmung von polychlorierten Biphenylen (PCB) in Lebensmitteln (§64 LFGB, Lebensmittel- und Futtermittelgesetzbuch)! 1993:08 Bundesamt für Verbraucherschutz und Lebensmittelsicherheit)(Determination of polychlorinated biphenyls (PCB) in food)
status: valid
status modified: 2025-08-25
accepted date: 2025-08-25
in scheme: Analysmetod

CEN_TS_16692-2015
type: Concept
definition: CEN/TS 16692:2015 Water quality - Determination of tributyltin (TBT) in whole water samples. Method using solid phase extraction (SPE) with SPE disks and gas chromatography with triple quadrupole mass spectrometry
status: valid
status modified: 2025-08-25
accepted date: 2025-08-25
in scheme: Analysmetod

CSN_46_5735
type: Concept
definition: CSN 46 5735 Industrial composts
status: valid
status modified: 2025-08-25
accepted date: 2025-08-25
in scheme: Analysmetod

CSN_72_0103
type: Concept
definition: CSN 72 0103 Basic procedure for the analysis of silicates - Determination of loss on ignition
status: valid
status modified: 2025-08-25
accepted date: 2025-08-25
in scheme: Analysmetod

CSN_EN_12176
type: Concept
definition: CSN EN 12176 Characterization of sludge - Determination of pH-value
status: valid
status modified: 2025-08-25
accepted date: 2025-08-25
in scheme: Analysmetod

CSN_EN_12879
type: Concept
definition: CSN EN 12879 Characterisation of sludges - Determination of the loss on ignition of dry mass
status: valid
status modified: 2025-08-25
accepted date: 2025-08-25
in scheme: Analysmetod

CSN_EN_13137
type: Concept
definition: CSN EN 13137 Characterisation of waste - Determination of total organic carbon (TOC) in waste, sludges and sediments (2002)
status: valid
status modified: 2025-08-25
accepted date: 2025-08-25
in scheme: Analysmetod

Anal_Chem_PFCAs_2005_modifierad
type: Concept
definition: Analytical Chemistry-PFCAs 2005 (modifierad). Matrix Effect-Free Analytical Methods for Determination of Perfluorinated Carboxylic Acids in Environmental Matrixes. Charles R. Powley, Stephen W. George, Timothy W. Ryan, and Robert C. Buck. Anal. Chem. 2005, 77, 19, 6353–6358. Publication Date:September 3, 2005.https://doi.org/10.1021/ac0508090. Perfluorocarboxylic acids (PFCAs) are persistent chemicals that have been found widely in the environment. Their accurate determination in environmental matrixes, particularly soil, sediment, and sludge, at low levels presents significant analytical challenges. The commercialization of electrospray interfaces for liquid chromatography−mass spectrometric analysis facilitated analysis of PFCAs at low levels, but issues with quantitative analysis due to matrix suppression or enhancement still persist. The methods described in this study utilize simple and rapid sample purification procedures to remove matrix components sufficiently so that errors due to coeluting matrix peaks are negligible and recoveries of PFCAs are consistently and reproducibly quantitative. Extracts from solid samples (soil and sediment) and liquid bacterial sludge are purified using dispersive solid-phase extraction. Recovery values generally are in the 70−120% range, with limits of quantitation of 1 ppb. The method utilizes an extraction solvent previously shown to release and recover aged residues of PFCAs. A confirmatory method using two precursor to product ions is also provided and demonstrated
status: valid
status modified: 2025-08-25
accepted date: 2025-08-25
in scheme: Analysmetod

BDS_AR_CALUX
type: Concept
definition: BDS-AR CALUX Analytical method from BioDetection Systems (BDS): Bioassay detection of androgen receptor activation (agonistic/antagonistic) of dihydrotestosterone (DHT). The samples were freeze dried, extracted with ASE (accelerated solvent extraction) with 100 % acetone, restituted in DMSO (dimethylsulfoxid) and subsequently measured in the CALUX bioassay. the AR CALUX bioassay comprises a human bone marrow cell line (U2OS), incorporating the firefly luciferase gene coupled to Androgen Responsive Elements (AREs) as a reporter gene. Following binding of androgen compounds to the intracellular androgen receptor, the ligand-receptor complex binds to and activates the ARE followed by expression of androgens and luciferace. By addition of substrate for luciferase, light is emitted which is measured in a luminometer. The amount of light produced is proportional to the amount of ligand-specific receptor binding, which is benchmarked against the reference compounds: dihydrotestosterone (agonistic) or flutamide (antagonistic). The amount of light of the samples is interpolated in the curve to obtain the reference equivalents. (Van der Burg, B., Van der Linden, S.C., Man, H.Y., Winter, R., Jonker, L., Van Vugt-Lussenburg, B., Brouwer, A. (2013) A panel of quantitative CALUX® reporter gene assays for reliable high throughput toxicity screening of chemicals and complex mixtures. In “High throughput screening methods in toxicity testing” (P. Steinberg, ed). John Wiley and Sons, Inc. New York. ISBN 9781118065631 pp. 519-532)
status: valid
status modified: 2025-08-25
accepted date: 2025-08-25
in scheme: Analysmetod

BDS_DR_CALUX
type: Concept
definition: BDS-DR CALUX. Analytical method of BioDetection Systems (BDS): Bioassay detection of AhR (aryl-hydrocarbon receptor/dioxinreceptor)-activity coupled to presence of dioxins (PCDD/PCDF/dl-PCB). The samples were freeze dried, extracted with ASE (accelerated solvent extraction) with acetone/hexane (10%/90% v/v) followed by an additional acid silica column clean-up, restituted in DMSO (dimethylsulfoxid) and subsequently measured in the CALUX bioassay. The DR CALUX bioassay comprise a rat hepatoma cell line (H4IIE), incorporating the firefly luciferase gene coupled to Dioxin Responsive Elements (DREs) as a reporter gene. Following binding of dioxin compounds to the intracellular dioxin receptor, the ligand-receptor complex binds to and activates the DRE followed by expression of dioxins and luciferace. By addition of substrate for luciferase, light is emitted which is measured in a luminometer. The amount of light produced is proportional to the amount of ligand-specific receptor binding, which is benchmarked against the relevant reference compounds; for DR CALUX: 2,3,7,8-TCDD. The amount of light of the samples is interpolated in the curve to obtain the reference equivalents. (Van der Burg, B., Van der Linden, S.C., Man, H.Y., Winter, R., Jonker, L., Van Vugt-Lussenburg, B., Brouwer, A. (2013) A panel of quantitative CALUX® reporter gene assays for reliable high throughput toxicity screening of chemicals and complex mixtures. In “High throughput screening methods in toxicity testing” (P. Steinberg, ed). John Wiley and Sons, Inc. New York. ISBN 9781118065631 pp. 519-532)
status: valid
status modified: 2025-08-25
accepted date: 2025-08-25
in scheme: Analysmetod

BDS_ER_CALUX
type: Concept
definition: BDS-ER CALUX Analytical method from BioDetection Systems (BDS): Bioassay detection of estrogen signalling of ER-activity (agonistic/antagonistic) for 17β-estradiol. The samples were freeze dried, extracted with ASE (accelerated solvent extraction) with 100% acetone, restituted in DMSO (dimethylsulfoxid) and subsequently measured in the CALUX bioassay. ER CALUX bioassay comprise a human breast cancer cell line (T47D), incorporating the firefly luciferase gene coupled to Estrogen Responsive Elements (EREs) as a reporter gene. Following binding of estrogen compounds to the intracellular estrogen alpha and beta receptors, the ligand-receptor complexes bind to and activate the ERE followed by expression of estrogens and luciferace. By addition of substrate for luciferase, light is emitted which is measured in a luminometer. The amount of light produced is proportional to the amount of ligand-specific receptor binding, which is benchmarked against the reference compound: 17β-estradiol. The amount of light of the samples is interpolated in the curve to obtain the reference equivalents. (Van der Burg, B., Van der Linden, S.C., Man, H.Y., Winter, R., Jonker, L., Van Vugt-Lussenburg, B., Brouwer, A. (2013) A panel of quantitative CALUX® reporter gene assays for reliable high throughput toxicity screening of chemicals and complex mixtures. In “High throughput screening methods in toxicity testing” (P. Steinberg, ed). John Wiley and Sons, Inc. New York. ISBN 9781118065631 pp. 519-532)
status: valid
status modified: 2025-08-25
accepted date: 2025-08-25
in scheme: Analysmetod

CSN_EN_13370
type: Concept
definition: CSN EN 13370
status: valid
status modified: 2025-08-25
accepted date: 2025-08-25
in scheme: Analysmetod

CSN_EN_1484
type: Concept
definition: CSN EN 1484
status: valid
status modified: 2025-08-25
accepted date: 2025-08-25
in scheme: Analysmetod

CSN_EN_15637
type: Concept
definition: CSN EN 15637 Foods of plant origin - Determination of pesticide residues using LC-MS/MS following methanol extraction and clean-up using diatomaceous earth
status: valid
status modified: 2025-08-25
accepted date: 2025-08-25
in scheme: Analysmetod

CSN_EN_16377_modifierad
type: Concept
definition: CSN EN 16377 (modifierad) Characterization of waste - Determination of brominated flame retardants (BFR) in solid waste
status: valid
status modified: 2025-08-25
accepted date: 2025-08-25
in scheme: Analysmetod

CSN_EN_ISO_22032_modifierad
type: Concept
definition: CSN EN ISO 22032 (modifierad) Water quality - Determination of selected polybrominated diphenyl ethers in sediment and sewage sludge - Method using extraction and gas chromatography/mass spectrometry
status: valid
status modified: 2025-08-25
accepted date: 2025-08-25
in scheme: Analysmetod

CSN_ISO_10694
type: Concept
definition: CSN ISO 10694 Soil quality - Determination of organic and total carbon after dry combustion (elementary analysis)
status: valid
status modified: 2025-08-25
accepted date: 2025-08-25
in scheme: Analysmetod

BDS_ERa_CALUX
type: Concept
definition: BDS-ERα CALUX Analytical method from BioDetection Systems (BDS): Bioassay detection of estrogen signalling of ER-activity (agonistic/antagonistic) for 17β-estradiol. The samples were freeze dried, extracted with ASE (accelerated solvent extraction) with 100% acetone, restituted in DMSO (dimethylsulfoxid) and subsequently measured in the CALUX bioassay. ERα CALUX bioassay comprises a human bone marrow cell line (U2OS), incorporating the firefly luciferase gene coupled to Estrogen Responsive Elements (EREs) as a reporter gene. Following binding of estrogen compounds to the intracellular estrogen alpha receptor, the ligand-receptor complex binds to and activates the ERE followed by expression of estrogens and luciferace. By addition of substrate for luciferase, light is emitted which is measured in a luminometer. The amount of light produced is proportional to the amount of ligand-specific receptor binding, which is benchmarked against the reference compounds: 17β-estradiol. The amount of light of the samples is interpolated in the curve to obtain the reference equivalents. (Van der Burg, B., Van der Linden, S.C., Man, H.Y., Winter, R., Jonker, L., Van Vugt-Lussenburg, B., Brouwer, A. (2013) A panel of quantitative CALUX® reporter gene assays for reliable high throughput toxicity screening of chemicals and complex mixtures. In “High throughput screening methods in toxicity testing” (P. Steinberg, ed). John Wiley and Sons, Inc. New York. ISBN 9781118065631 pp. 519-532)
status: valid
status modified: 2025-08-25
accepted date: 2025-08-25
in scheme: Analysmetod

BDS_PAH_CALUX
type: Concept
definition: BDS-PAH CALUX. Analytical method of BioDetection Systems (BDS): Bioassay detection of ArH-activity coupled to presence of PAH. The samples were freeze dried, extracted with ASE (accelerated solvent extraction) with acetone/hexane (10%/90% v/v), restituted in DMSO (dimethylsulfoxid) and subsequently measured in the CALUX bioassay. The PAH CALUX bioassay comprises a rat hepatoma cell line (H4IIE), incorporating the firefly luciferase gene coupled to Dioxin Responsive Elements (DREs) as a reporter gene. Following binding of PAH compounds to the intracellular dioxin receptor, the ligand-receptor complex binds to and activates the DRE followed by expression of PAH and luciferace. By addition of substrate for luciferase, light is emitted which is measured in a luminometer. The amount of light produced is proportional to the amount of ligand-specific receptor binding, which is benchmarked against the reference compound: Benzo[a]pyrene (B[a])P). The amount of light of the samples is interpolated in the curve to obtain the reference equivalents. (Van der Burg, B., Van der Linden, S.C., Man, H.Y., Winter, R., Jonker, L., Van Vugt-Lussenburg, B., Brouwer, A. (2013) A panel of quantitative CALUX® reporter gene assays for reliable high throughput toxicity screening of chemicals and complex mixtures. In “High throughput screening methods in toxicity testing” (P. Steinberg, ed). John Wiley and Sons, Inc. New York. ISBN 9781118065631 pp. 519-532)
status: valid
status modified: 2025-08-25
accepted date: 2025-08-25
in scheme: Analysmetod

CSN_ISO_11261
type: Concept
definition: CSN ISO 11261 Soil quality - Determination of total nitrogen, modified Kjeldahl method
status: valid
status modified: 2025-08-25
accepted date: 2025-08-25
in scheme: Analysmetod

CSN_P_CEN_TS_15968
type: Concept
definition: CSN P CEN/TS 15968 Determination of extractable perfluorooctanesulphonate (PFOS) in coated and impregnated solid articles, liquids and fire fighting foams - Method for sampling, extraction and analysis by LCqMS or LC-tandem/MS
status: valid
status modified: 2025-08-25
accepted date: 2025-08-25
in scheme: Analysmetod

DIN_19742_2012
type: Concept
definition: DIN 19742:2012 Soil quality - Determination of selected phthalates in sludge, sediment, solid waste and soil after extraction and determination using gas chromatography mass spectrometry (GC-MS). 2012-04
status: valid
status modified: 2025-08-25
accepted date: 2025-08-25
in scheme: Analysmetod

DIN_19742_2014
type: Concept
definition: DIN 19742:2014-08 Soil quality - Determination of selected phthalates in sludge, sediment, solid waste and soil after extraction and determination using gas chromatography mass spectrometry (GC-MS). 2014-08
status: valid
status modified: 2025-08-25
accepted date: 2025-08-25
in scheme: Analysmetod

DIN_19744
type: Concept
definition: DIN 19744 Identification and quantitative determination of organic stannic compounds in solid materials (soils, sediments, wastes)
status: valid
status modified: 2025-08-25
accepted date: 2025-08-25
in scheme: Analysmetod

DIN_38407_27
type: Concept
definition: DIN 38407-27 German standard methods for the examination of water, waste water and sludge - Jointly determinable substances (group F) - Part 27: Determination of selected phenols in groundwater and leachate, aqueous eluates and percolates (F 27)
status: valid
status modified: 2025-08-25
accepted date: 2025-08-25
in scheme: Analysmetod

DIN_38407_3
type: Concept
definition: DIN 38407-3 German standard methods for the examination of water, waste water and sludge - Substance group analysis (group F) - Part 3: Determination of polychlorinated biphenyls (PCBs) by gas chromatography (F 3)
status: valid
status modified: 2025-08-25
accepted date: 2025-08-25
in scheme: Analysmetod

DIN_38407_35
type: Concept
definition: DIN 38407-35 German standard methods for the examination of water, waste water and sludge - Jointly determinable substances (group F) - Part 35: Determination of selected phenoxyalkyl carbonic acids and further acid plant treatment agents - Method using high performance liquid chromatography and mass spectrometric detection (HPLC-MS/MS) (F 35)
status: valid
status modified: 2025-08-25
accepted date: 2025-08-25
in scheme: Analysmetod

DIN_38407_36
type: Concept
definition: DIN 38407-36 German standard methods for the examination of water, waste water and sludge - Jointly determinable substances (group F) - Part 36: Determination of selected active substances of plant protection products and other organic substances in water - Method using high performance liquid chromatography and mass spectrometric detection (HPLC-MS/MS or -HRMS) after direct injection (F 36)
status: valid
status modified: 2025-08-25
accepted date: 2025-08-25
in scheme: Analysmetod

DIN_38407_42_UNEP_2015_modifierad
type: Concept
definition: DIN 38407-42, UNEP Chemicals Branch 2015 (modifierad). Metod för analys av PFAS angiven på Eurofins analysrapporter
status: valid
status modified: 2025-08-25
accepted date: 2025-08-25
in scheme: Analysmetod

DIN_38407_42_modifierad
type: Concept
definition: DIN 38407-42 (modifierad) German standard methods for the examination of water, waste water and sludge - Jointly determinable substances (group F) - Part 42: Determination of selected polyfluorinated compounds (PFC) in water - Method using high performance liquid chromatography and mass spectrometric detection (HPLC/MS-MS) after solid-liquid extraction (F 42)
status: valid
status modified: 2025-08-25
accepted date: 2025-08-25
in scheme: Analysmetod

DIN_38407_F13
type: Concept
definition: DIN 38407-F13 DIN German standard methods for the examination of water, waste water and sludge - Substances group analysis (group F) - Part 13: Determination of selected organotin compounds by gas chromatography (F 13)
status: valid
status modified: 2025-08-25
accepted date: 2025-08-25
in scheme: Analysmetod

DIN_38407_F2
type: Concept
definition: DIN 38407-F2 German standard methods for the examination of water, waste water and sludge; substance group analysis (group F); determination of low-volatility halogenated hydrocarbons by gas chromatography (F 2)
status: valid
status modified: 2025-08-25
accepted date: 2025-08-25
in scheme: Analysmetod

DIN_38407_F39
type: Concept
definition: DIN 38407-F39 German standard methods for the examination of water, waste water and sludge - Jointly determinable substances (group F) - Part 39: Determination of selected polycyclic aromatic hydrocarbons (PAH) - Method using gas chromatography with mass spectrometric detection (GC-MS) (F 39)
status: valid
status modified: 2025-08-25
accepted date: 2025-08-25
in scheme: Analysmetod

DIN_38407_F9_1
type: Concept
definition: DIN 38407-F9-1 German standard methods for the examination of water, waste water and sludge; substance group analysis (group F); determination of benzene and some of its derivatives by gas chromatography (F 9)
status: valid
status modified: 2025-08-25
accepted date: 2025-08-25
in scheme: Analysmetod

DIN_38414_14
type: Concept
definition: DIN 38414-14 German standard methods for the examination of water, waste water and sludge - Sludge and sediments (group S) - Part 14: Determination of selected polyfluorinated compounds (PFC) in sludge, compost and soil - Method using high performance liquid chromatography and mass spectrometric detection (HPLC-MS/MS) (S 14)
status: valid
status modified: 2025-08-25
accepted date: 2025-08-25
in scheme: Analysmetod

DIN_38414_14_modifierad
type: Concept
definition: DIN 38414-14 (modifierad) German standard methods for the examination of water, waste water and sludge - Sludge and sediments (group S) - Part 14: Determination of selected polyfluorinated compounds (PFC) in sludge, compost and soil - Method using high performance liquid chromatography and mass spectrometric detection (HPLC-MS/MS) (S 14)
status: valid
status modified: 2025-08-25
accepted date: 2025-08-25
in scheme: Analysmetod

DIN_38414_22
type: Concept
definition: DIN 38414-22 German standard methods for the examination of water, waste water and sludge - Sludge and sediments (group S) - Part 22: Determination of dry residue by freezing and preparation of the freeze dried mass of sludge (S 22)
status: valid
status modified: 2025-08-25
accepted date: 2025-08-25
in scheme: Analysmetod

DIN_38414_S24
type: Concept
definition: DIN 38414-S24 German standard methods for the examination of water, waste water and sludge - Sludge and sediments (group S) - Part 24: Determination of polychlorinated dibenzodioxins (PCDDs) and polychlorinated dibenzofuranes (PCDFs) (S 24)
status: valid
status modified: 2025-08-25
accepted date: 2025-08-25
in scheme: Analysmetod

DIN_EN_12673_F15
type: Concept
definition: DIN EN 12673-F15 Vattenundersökningar - Gaskromatografisk bestämning av ett antal klorfenoler i vatten
status: valid
status modified: 2025-08-25
accepted date: 2025-08-25
in scheme: Analysmetod

DIN_EN_13806_2002
type: Concept
definition: EN 13806:2002 Foodstuffs - Determination of trace elements - Determination of mercury by cold-vapour atomic absorption spectrometry (CVAAS) after pressure digestion(BVL L 00.00-19/4 Untersuchung von Lebensmitteln. Bestimmung von Quecksilber mit Atomabsorptionsspektrometrie (AAS) - Kaltdampftechnik nach Druckaufschluss in Lebensmitteln; (Abweichung: Matrix auch Futtermittel)
status: valid
status modified: 2025-08-25
accepted date: 2025-08-25
in scheme: Analysmetod

DIN_EN_14083_2003
type: Concept
definition: DIN EN 14083:2003 Foodstuffs - Determination of trace elements - Determination of lead, cadmium, chromium and molybdenum by graphite furnace atomic absorption spectrometry (GFAAS) after pressure digestion(BLV L 00.00-19/3 Untersuchung von Lebensmitteln - Bestimmung von Elementspuren - Bestimmung von Blei, Cadmium, Chrom und Molybdän mit Graphitofen-Atomabsorptionsspektrometrie (GFAAS) nach Druckaufschluss)
status: valid
status modified: 2025-08-25
accepted date: 2025-08-25
in scheme: Analysmetod

DIN_EN_16277_2011
type: Concept
definition: DIN EN 16277:2011 Animal feeding stuffs - Determination of mercury by cold-vapour atomic absorption spectrometry (CVAAS) after microwave pressure digestion (extraction with 65 % nitric acid and 30 % hydrogen peroxide); German version prEN 16277:2011 / Note: Date of issue 2011-05-09
status: valid
status modified: 2025-08-25
accepted date: 2025-08-25
in scheme: Analysmetod

DIN_EN_ISO_10301
type: Concept
definition: DIN EN ISO 10301 Determination of highly volatile halogenated hydrocarbons in water - Gas-chromatographic methods (ISO 10301:1997)
status: valid
status modified: 2025-08-25
accepted date: 2025-08-25
in scheme: Analysmetod

DIN_EN_ISO_10301_F4
type: Concept
definition: DIN EN ISO 10301-F4 Determination of highly volatile halogenated hydrocarbons in water - Gas-chromatographic methods
status: valid
status modified: 2025-08-25
accepted date: 2025-08-25
in scheme: Analysmetod

DIN_EN_ISO_11369
type: Concept
definition: DIN EN ISO 11369 Water quality - Determination of selected plant treatment agents - Method using high performance liquid chromatography with UV detection after solid-liquid extraction (ISO 11369:1997)
status: valid
status modified: 2025-08-25
accepted date: 2025-08-25
in scheme: Analysmetod

DIN_EN_ISO_11732_E23
type: Concept
definition: DIN EN ISO 11732-E23
status: valid
status modified: 2025-08-25
accepted date: 2025-08-25
in scheme: Analysmetod

DIN_EN_ISO_12010_2014_07
type: Concept
definition: DIN EN ISO 12010:2014-07 Water quality - Determination of short-chain polychlorinated alkanes (SCCPs) in water - Method using gas chromatography-mass spectrometry (GC-MS) and negative-ion chemical ionization (NCI) (ISO 12010:2012)
status: valid
status modified: 2025-08-25
accepted date: 2025-08-25
in scheme: Analysmetod

DIN_EN_ISO_15680_F19
type: Concept
definition: DIN EN ISO 15680-F19 Water quality — Gas-chromatographic determination of a number of monocyclic aromatic hydrocarbons, naphthalene and several chlorinated compounds using purge-and-trap and thermal desorption
status: valid
status modified: 2025-08-25
accepted date: 2025-08-25
in scheme: Analysmetod

DIN_EN_ISO_17294-2-E29
type: Concept
definition: DIN EN ISO 17294-2-E29 Water quality - Application of inductively coupled plasma mass spectrometry (ICP-MS) - Part 2: Determination of selected elements including uranium isotopes
status: valid
status modified: 2025-08-25
accepted date: 2025-08-25
in scheme: Analysmetod

DIN_EN_ISO_17353_F13
type: Concept
definition: DIN EN ISO 17353-F13 Water quality - Determination of selected organotin compounds - Gas chromatographic method
status: valid
status modified: 2025-08-25
accepted date: 2025-08-25
in scheme: Analysmetod

DIN_EN_ISO_18856
type: Concept
definition: DIN EN ISO 18856 Water quality - Determination of selected phthalates using gas chromatography/mass spectrometry (ISO 18856:2004)
status: valid
status modified: 2025-08-25
accepted date: 2025-08-25
in scheme: Analysmetod

DIN_EN_ISO_18857
type: Concept
definition: DIN EN ISO 18857-1 Water quality - (ISO 18857-1:2005)ELLER: ?DIN EN ISO 18857-2 Determination of selected alkylphenols - Part 2: Gas chromatographic-mass spectrometric determination of alkylphenols, their ethoxylates and bisphenol A in non-filtered samples following solid-phase extraction and derivatisation (ISO 18857-2:2009)
status: valid
status modified: 2025-08-25
accepted date: 2025-08-25
in scheme: Analysmetod

DIN_EN_ISO_18857_2_2012_01
type: Concept
definition: DIN EN ISO 18857-2:2012-01 Water quality - Determination of selected alkylphenols - Part 2: Gas chromatographic-mass spectrometric determination of alkylphenols, their ethoxylates and bisphenol A in non-filtered samples following solid-phase extraction and derivatisation. STANDARD published on 1.1.2012
status: valid
status modified: 2025-08-25
accepted date: 2025-08-25
in scheme: Analysmetod

DIN_EN_ISO_22032
type: Concept
definition: DIN EN ISO 22032 Water quality - Determination of selected polybrominated diphenyl ethers in sediment and sewage sludge - Method using extraction and gas chromatography/mass spectrometry (ISO 22032:2006)
status: valid
status modified: 2025-08-25
accepted date: 2025-08-25
in scheme: Analysmetod

DIN_EN_ISO_23161_E
type: Concept
definition: DIN EN ISO 23161 (E) Markundersökningar - Bestämning av vissa organiska tennföreningar - Metod med gas-kromatografi
status: valid
status modified: 2025-08-25
accepted date: 2025-08-25
in scheme: Analysmetod

DIN_EN_ISO_6468
type: Concept
definition: DIN EN ISO 6468 Water quality — Determination of certain organochlorine insecticides, polychlorinated biphenyls and chlorobenzenes — Gas chromatographic method after liquid-liquid extraction (ISO 6468:1996). Edition 1
status: valid
status modified: 2025-08-25
accepted date: 2025-08-25
in scheme: Analysmetod

DIN_ISO_10382
type: Concept
definition: DIN ISO 10382 Soil quality - Determination of organochlorine pesticides and polychlorinated biphenyls - Gas-chromatographic method with electron capture detection (ISO 10382:2002)
status: valid
status modified: 2025-08-25
accepted date: 2025-08-25
in scheme: Analysmetod

DIN_ISO_14154_2005
type: Concept
definition: DIN ISO 14154 Soil quality - Determination of some selected chlorophenols - Gas-chromatographic method with electron-capture detection (ISO 14154:2005)
status: valid
status modified: 2025-08-25
accepted date: 2025-08-25
in scheme: Analysmetod

DIN_ISO_18287
type: Concept
definition: DIN ISO 18287 Soil quality - Determination of polycyclic aromatic hydrocarbons (PAH) - gas chromatographic method with mass spectrometric detection (GC-MS) (ISO 18287:2006)
status: valid
status modified: 2025-08-25
accepted date: 2025-08-25
in scheme: Analysmetod

DIOXIN_I-TEQ
type: Concept
definition: Beräkningsmetod för analys av I-TEQ toxicitetsekvivalenter fär dioxiner inkluderande PCDD/PCDF, beräknad enligt NATO: F. W. Kutz et al: The international toxicity equivalency factor (I-TEF) method of risk assessment for complex mixtures of dioxins and related compounds. Chemosphere 20:751–757, 1990, cited after Ballschmiter und Bacher (1996); this system has first been suggested by the NATO-Committee on the challenges of the Modern Society (NATO-CCMS): International toxicity equivalency factor (TEF) method of risk assessment for completely mixtures of dioxins and related compounds. Pilot study on international information exchange on dioxins and related compounds, report no. 176, 1988
status: valid
status modified: 2025-08-25
accepted date: 2025-08-25
in scheme: Analysmetod

DIOXIN_WHO2005-TEQ
type: Concept
definition: Beräkningsmetod för analys av WHO2005-TEQ toxicitetsekvivalenter för dioxiner inkluderande PCDD, PCDF och dioxinlika PCB, beräknad enligt WHO2005: Van den Berg M, Birnbaum LS, Denison M, DeVito M, Farland W, Feeley M, Fiedler H, Hakansson H, Hanberg A, Haws L, Rose M, Safe S, Schrenk D, Tohyama C, Tritscher A, Tuomisto J, Tysklind M, Walker N & Peterson RE, 2006. Review: the 2005 world health organization reevaluation of human and mammalian toxic equivalency factors for dioxins and dioxin-like compounds. Toxicological Sciences 93, 223-241. URL: http://scholar.google.se/scholar_url?hl=sv&q=http://www.who.int/entity/foodsafety/chem/2005_WHO_TEFs_ToxSci_2006.pdf&sa=X&scisig=AAGBfm02J1s_-eTLq2asWP-yy9WMKkq4pA&oi=scholarr&ei=o49fVNnyDIn1asflgtgP&ved=0CB4QgAMoADAA
status: valid
status modified: 2025-08-25
accepted date: 2025-08-25
in scheme: Analysmetod

EC_589_2014
type: Concept
definition: (EC) No 589/2014 of 2 June 2014 laying down methods of sampling and analysis for the control of levels of dioxins, dioxin-like PCBs and non-dioxin-like PCBs in certain foodstuffs
status: valid
status modified: 2025-08-25
accepted date: 2025-08-25
in scheme: Analysmetod

EC_589_2015
type: Concept
definition: (EC) No 589/2014 of 2 June 2014 laying down methods of sampling and analysis for the control of levels of dioxins, dioxin-like PCBs and non-dioxin-like PCBs in certain foodstuffs
status: valid
status modified: 2025-08-25
accepted date: 2025-08-25
in scheme: Analysmetod

EC_589_2016
type: Concept
definition: (EC) No 589/2014 of 2 June 2014 laying down methods of sampling and analysis for the control of levels of dioxins, dioxin-like PCBs and non-dioxin-like PCBs in certain foodstuffs
status: valid
status modified: 2025-08-25
accepted date: 2025-08-25
in scheme: Analysmetod

EF_0374_PFAS
type: Concept
definition: Eurofins (Vejen DK) interna metod 0374 . vatten, sediment, jord, livsmedel, biota - Bestämning av PFAS-föreningar efter passiv provtagning med sorbiceller i vatten. Demontering av sorbicell innan analys
status: valid
status modified: 2025-08-25
accepted date: 2025-08-25
in scheme: Analysmetod

EF_2060_PHTHALATES
type: Concept
definition: Eurofins internal method 2060: Determination of phthalates in sludge by purge-and-trap using GC-MS
status: valid
status modified: 2025-08-25
accepted date: 2025-08-25
in scheme: Analysmetod

EF_BHT
type: Concept
definition: Eurofins-BHT: Determination of butylhydroxytoluene in water and sludge by purge-and-trap using GC/MS. (Method as in: Lipids vol 33, 1998)
status: valid
status modified: 2025-08-25
accepted date: 2025-08-25
in scheme: Analysmetod

EF_LidMiljo_0A_01_09_SPI_2011
type: Concept
definition: Eurofins Interna metod LidMiljö.0A.01.09, SPI 2011 Vatten, slam/sediment, jord - Bestämning av BTEX, alifatiska och aromatiska kolväten <C10. Vatten hälls upp på vial och analyseras med HS-GC-MS. Fasta prover vägs in i vial varvid vatten med en liten mängd metanol tillsätts, provet värms upp, ångan injiceras och analys sker med HSGC-MS
status: valid
status modified: 2025-08-25
accepted date: 2025-08-25
in scheme: Analysmetod

EF_LidMiljo_0A_01_16
type: Concept
definition: Eurofins Interna metod LidMiljö.0A.01.16 Betong, jord, sediment, slam, övrigt fast material - Bestämning av olika klorerade alifater. Efter extraktion sker analys med GC-MS/MS
status: valid
status modified: 2025-08-25
accepted date: 2025-08-25
in scheme: Analysmetod

EF_LidMiljo_0A_01_44_51
type: Concept
definition: Eurofins interna metod LidMiljö.0A.01.44/51 Vatten, slam/sediment, jord, byggnadsmaterial - Bestämning av PAH, alifatiska och aromatiska kolväten >C10-C35, PCB. Provet extraheras med en blandning av organiska lösningsmedel och analyseras med GC-MS
status: valid
status modified: 2025-08-25
accepted date: 2025-08-25
in scheme: Analysmetod

EF_LidPest_0A_01_025_PFAS
type: Concept
definition: Eurofins interna metod LidPest.0A.01.025 Vatten, sediment, jord, livsmedel, biota, betong - Bestämning av PFAS-föreningar. Provet extraheras med basisk metanol och analyseras med UPLC-MS-MS
status: valid
status modified: 2025-08-25
accepted date: 2025-08-25
in scheme: Analysmetod

EF_LidPest_0A_01_028_PFAS
type: Concept
definition: Eurofins interna metod LidPest.0A.01.028 Vatten, sediment, jord, livsmedel, biota. Bestämning av PFAS-föreningar efter passiv provtagning med sorbiceller i vatten. Provet (resin från provtagare = sorbicell) extraheras med metanol och analyseras med UPLC-MS-MS
status: valid
status modified: 2025-08-25
accepted date: 2025-08-25
in scheme: Analysmetod

EF_LidPest_0A_01_09_SPI_2011
type: Concept
definition: Eurofins interna metod LidPest.0A.01.09, SPI 2011 Vatten - Bestämning av BTEX, alifater, aromater, PAH, tungmetaller
status: valid
status modified: 2025-08-25
accepted date: 2025-08-25
in scheme: Analysmetod

EF_LidPest_0A_01_27_FTOH
type: Concept
definition: Eurofins interna metod LidPest.0A.01.27 (In house method 210) Vatten - Bestämning av PFAS-föreningar (fluortelomeralkoholer, FTOH). Provet spädes 2x med metanol och koncentreras på SPE-kolonn. Efter eluering med metanol injiceras eluatet på UPLC-MS-MS
status: valid
status modified: 2025-08-25
accepted date: 2025-08-25
in scheme: Analysmetod

EF_LidPest_0A_01_34_UK-PFAS
type: Concept
definition: Eurofins interna metod LidPest.0A.01.34 Vatten - Bestämning av ultrakorta PFAS-föreningar: PFEtS (perfluoretansulfonsyra), PFPrA (perfluorpropansyra), PFPrS (perfluorpropansulfonsyra), TFA (trifluorättiksyra), TFMS (trifluormetansulfonsyra). Provet direktinjiceras och analyseras sedan på UPLC-MS-MS
status: valid
status modified: 2025-08-25
accepted date: 2025-08-25
in scheme: Analysmetod

EF_M0250_MILJOFRAMM_AMNEN
type: Concept
definition: Eurofins interna metod M0250 - Bestämning av miljöfrämmande ämnen i vatten. Analys av ftalater, PAH, PCB och alkylfenoler. Provet tillsätts interna standarder, extraheras med cyklohexan och analyseras med GC-MS
status: valid
status modified: 2025-08-25
accepted date: 2025-08-25
in scheme: Analysmetod

EJ_REL
type: Concept
definition: Ej relevant, information ej av betydelse för parametern
status: valid
status modified: 2025-08-25
accepted date: 2025-08-25
in scheme: Analysmetod

EN_ISO_15009_2016
type: Concept
definition: EN ISO 15009:2016 Soil quality - Gas chromatographic determination of the content of volatile aromatic hydrocarbons, naphthalene and volatile halogenated hydrocarbons - Purge-and-trap method with thermal desorption (ISO 15009:2016)
status: valid
status modified: 2025-08-25
accepted date: 2025-08-25
in scheme: Analysmetod

EN_ISO_17353
type: Concept
definition: EN ISO 17353 - Water quality — Determination of selected organotin compounds — Gas chromatographic method
status: valid
status modified: 2025-08-25
accepted date: 2025-08-25
in scheme: Analysmetod

EN_ISO_6468_F1
type: Concept
definition: EN ISO 6468-F1
status: valid
status modified: 2025-08-25
accepted date: 2025-08-25
in scheme: Analysmetod

EPA_1668
type: Concept
definition: US EPA 1668 Determination of the toxic polychlorinated biphenyls (PCBs) in water, soil, sediment, sludge, tissue, and other sample matricess by isotope dilution and internal standard high-resolution gas chromatography/high-resolution mass spectrometry, HRGC/HRMS
status: valid
status modified: 2025-08-25
accepted date: 2025-08-25
in scheme: Analysmetod

EPA_200_7_modifierad
type: Concept
definition: EPA 200.7 (modifierad) (US EPA 200.7, modifierad) Determination of Metals and Trace Elements in Water and Wastes by Inductively Coupled Plasma-Atomic Emission Spectrometry
status: valid
status modified: 2025-08-25
accepted date: 2025-08-25
in scheme: Analysmetod

EPA_200_8_modifierad
type: Concept
definition: EPA 200.8 (modifierad) (US EPA 200.7, modifierad) Determination of Trace Elements in Waters and Wastes by Inductively Coupled Plasma-Mass Spectrometry
status: valid
status modified: 2025-08-25
accepted date: 2025-08-25
in scheme: Analysmetod

ERKEN_ES04
type: Concept
definition: Erkenlaboratoriets metod ES04 för totalfosfor med glödgning. Baserad på Andersen J, 1975, Freshwater Biological Lab, University of Copenhagen och egen metodik.
status: valid
status modified: 2025-08-25
accepted date: 2025-08-25
in scheme: Analysmetod

ERKEN_ES05
type: Concept
definition: Erkenlaboratoriets metod ES05 för fosforfraktionering. Baserad på Hieltjes & Lijklema 1980, Psenner et al 1988 (endast BD-fraktionen), Ahlgren & Ahlgren, 1976 och egen metodik. I korthet extraheras olika former av fosfor i följande steg: 1 M NH4Cl, 0,11 M natriumdithionit/natriumbikarbonat, 0,1 M NaOH och 0,5 M HCl. Mellan varje extraktion centrifugeras sedimentet ned i rören.
status: valid
status modified: 2025-08-25
accepted date: 2025-08-25
in scheme: Analysmetod

ER_T47D
type: Concept
definition: ER-T47D: Effektbaserad analys av ER (östrogenreceptor)-aktivitet med luciferas gen-expression i celler från cellinjen T47D med ursprung från humana bröstcancer-celler. Används i biotest för bestämning av human östrogenreceptor-aktivitet av kemikalier. Cellinjen är stabilt transfekterad med östrogenreceptor samt en luciferas-reportergen. Mätbart ljus emitteras i respons till östrogen och östrogen-lika ämnen och detekteras av spektrofotometer
status: valid
status modified: 2025-08-25
accepted date: 2025-08-25
in scheme: Analysmetod

ER_VM7Luc4E2
type: Concept
definition: ER-VM7Luc4E2: Effektbaserad analys av ER (östrogenreceptor)-aktivitet och anti-ER-aktivitet med luciferas gen-expression i celler från cellinjen VM7Luc4E2 med ursprung från humana bröstcancer-celler. Används i biotest för bestämning av human östrogenreceptor agonist- och antagonist-aktivitet av kemikalier. Testmetoden mäter i vilken utsträckning ett ämne inducerar eller inhiberar transkriptionell aktivitet via ER-medierade reaktioner.Cellinjen är stabilt transfekterad med östrogenreceptor samt en luciferas-reportergen. Mätbart ljus emitteras i respons till östrogen och östrogen-lika ämnen och detekteras av spektrofotometer
status: valid
status modified: 2025-08-25
accepted date: 2025-08-25
in scheme: Analysmetod

EU_2017_644
type: Concept
definition: EU-förordning 2017/644 - Om provtagnings- och analysmetoder för kontroll av halter av dioxiner, dioxinlika PCB och icke- dioxinlika PCB i vissa livsmedel och om upphävande av förordning (EU) nr 589/2014
status: valid
status modified: 2025-08-25
accepted date: 2025-08-25
in scheme: Analysmetod

E_DIN_ISO_13877
type: Concept
definition: E DIN ISO 13877 Soil quality - Determination of polynuclear aromatic hydrocarbons — Method using high -performance liquid chromatography
status: valid
status modified: 2025-08-25
accepted date: 2025-08-25
in scheme: Analysmetod

FASTFAS_EXTR_Cu
type: Concept
definition: Fast fas-extraktion av koppar med "multilayer SPE (SPE: solid phase extraction); for soil/sediment/sludge an additional activated copper treatment is applied"
status: valid
status modified: 2025-08-25
accepted date: 2025-08-25
in scheme: Analysmetod

GBA_PI_MA_M_02_028_2019_09
type: Concept
definition: GBA Gesellschaft für Bioanalytik mbH, In-house method PI-MA-M 02-028: 2019-09 - Determination of selected PFAS in water, solids and biota by LC-MS/MS after solid phase extraction
status: valid
status modified: 2025-08-25
accepted date: 2025-08-25
in scheme: Analysmetod

GBA_PI_MA_M_02_028_2023_06
type: Concept
definition: GBA Gesellschaft für Bioanalytik mbH, In-house method PI-MA-M 02-028: 2023-06 - Determination of selected PFAS in water, solids and biota by LC-MS/MS after solid phase extraction
status: valid
status modified: 2025-08-25
accepted date: 2025-08-25
in scheme: Analysmetod

GBA_PI_MA_M_03_112_2017_02
type: Concept
definition: GBA Gesellschaft für Bioanalytik mbH, analytic method PI-MA-M 03-112: 2017-02 - Analysis of estrogens, estrogen metabolites and sitosterol in water and soil samples
status: valid
status modified: 2025-08-25
accepted date: 2025-08-25
in scheme: Analysmetod

GRAVIMETRI
type: Concept
definition: Gravimetri. Gravimetrisk analys eller viktanalys avser inom kemi analytiska metoder för att bestämma halten av ett ämne i ett prov med hjälp av ytterst noggranna analysvågar
status: valid
status modified: 2025-08-25
accepted date: 2025-08-25
in scheme: Analysmetod

GR_GeneBLAzer
type: Concept
definition: GR-GeneBLAzer: Effektbaserad analys av GR (glukokortikoid-receptor)-aktivitet som ett mått på immun- och inflammations-respons i celler från cellinjen GeneBLAzer®UAS-bla HEK 293T med ursprung i humana embryoala njurceller. Cellinjen är stabilt transkriberad med human glukokortikoid-receptor (GR) och en beta-laktamas reportergen. När en agonist binder till receptorn bildas beta-laktamas vilken kan mätas som fluorescens
status: valid
status modified: 2025-08-25
accepted date: 2025-08-25
in scheme: Analysmetod

HC_EF_IMP_2016
type: Concept
definition: HELCOM Guidelines for monitoring of biological effect - imposex and intersex (2016)
status: valid
status modified: 2025-08-25
accepted date: 2025-08-25
in scheme: Analysmetod

HGDMA
type: Concept
definition: HgDMA - Bestämning av kvicksilver. Direkt förbränning, amalgamering och analys med atomabsorptionsspektrometri (AAS)
status: valid
status modified: 2025-08-25
accepted date: 2025-08-25
in scheme: Analysmetod

HepG2_NFκB
type: Concept
definition: HepG2-NFκB: Effektbaserad analys av NFκβ ("nuclear factor: kappa light chain enhancer of activated B cells")-aktivitet som ett mått på immun- och inflammations-respons med luciferas gen-expression i celler från cellinjen HepG2-NFκβ i celler från humant hepatom. Cellinjen är stabilt transfekterad med NFκβ-responsivt element samt en luciferas-reportergen Mätbart ljus emitteras i respons till NFκβ-aktivitet och detekteras av spektrofotometer
status: valid
status modified: 2025-08-25
accepted date: 2025-08-25
in scheme: Analysmetod

ISO_10694
type: Concept
definition: ISO 10694 Soil quality - Determination of organic and total carbon after dry combustion (elementary analysis)
status: valid
status modified: 2025-08-25
accepted date: 2025-08-25
in scheme: Analysmetod

ISO_12010
type: Concept
definition: ISO 12010
status: valid
status modified: 2025-08-25
accepted date: 2025-08-25
in scheme: Analysmetod

ISO_13878
type: Concept
definition: ISO 13878 Soil quality - Determination of total nitrogen content by dry combustion ("elemental analysis")
status: valid
status modified: 2025-08-25
accepted date: 2025-08-25
in scheme: Analysmetod

ISO_15923_1_2013
type: Concept
definition: ISO 15923-1:2013 Water quality — Determination of selected parameters by discrete analysis systems — Part 1: Ammonium, nitrate, nitrite, chloride, orthophosphate, sulfate and silicate with photometric detection
status: valid
status modified: 2025-08-25
accepted date: 2025-08-25
in scheme: Analysmetod

ISO_15923_1_2013_C
type: Concept
definition: ISO 15923-1:2013 Water quality — Determination of selected parameters by discrete analysis systems — Part 1: Ammonium, nitrate, nitrite, chloride, orthophosphate, sulfate and silicate with photometric detection. Annex C: Determination of nitrate and nitrite by the hydrazine method
status: valid
status modified: 2025-08-25
accepted date: 2025-08-25
in scheme: Analysmetod

ISO_18857_2_2009
type: Concept
definition: ISO 18857-2:2009 Water quality — Determination of selected alkylphenols — Part 2: Gas chromatographic-mass spectrometric determination of alkylphenols, their ethoxylates and bisphenol A in non-filtered samples following solid-phase extraction and derivatisation
status: valid
status modified: 2025-08-25
accepted date: 2025-08-25
in scheme: Analysmetod

ISO_21458_2008
type: Concept
definition: ISO 21458:2008 Water quality — Determination of glyphosate and AMPA — Method using high performance liquid chromatography (HPLC) and fluorometric detection
status: valid
status modified: 2025-08-25
accepted date: 2025-08-25
in scheme: Analysmetod

ISO_21458_2008_modifierad
type: Concept
definition: ISO 21458:2008 (modifierad) Water quality — Determination of glyphosate and AMPA — Method using high performance liquid chromatography (HPLC) and fluorometric detection
status: valid
status modified: 2025-08-25
accepted date: 2025-08-25
in scheme: Analysmetod

ISO_21675_2019
type: Concept
definition: ISO 21675:2019 Water quality — Determination of perfluoroalkyl and polyfluoroalkyl substances (PFAS) in water — Method using solid phase extraction and liquid chromatography-tandem mass spectrometry (LC-MS/MS)
status: valid
status modified: 2025-08-25
accepted date: 2025-08-25
in scheme: Analysmetod

ISO_28540_2011
type: Concept
definition: ISO 28540:2011 Water quality - Determination of 16 polycyclic aromatic hydrocarbons (PAH) in water - Method using gas chromatography with mass spectrometric detection (GC-MS) (ISO 28540:2011 specifies a method for the determination of at least 16 selected PAH (see Table 1) in drinking water and ground water in mass concentrations above 0,005 µg/l and surface water in mass concentrations above 0,01 µg/l (for each individual compound). ISO 28540:2011 can be used for samples containing up to 150 mg/l of suspended matter. This method is, with some modification, also suitable for the analysis of waste water. It is possible that this method is applicable to other PAH, provided the method is validated for each case.)
status: valid
status modified: 2025-08-25
accepted date: 2025-08-25
in scheme: Analysmetod

ISO_29441_2010
type: Concept
definition: Water quality - Determination of total nitrogen after UV digestion - Method using flow analysis (CFA and FIA) and spectrometric detection
status: valid
status modified: 2025-08-25
accepted date: 2025-08-25
in scheme: Analysmetod

ISO_7150_1_1984
type: Concept
definition: ISO 7150-1:1984 Water quality - Determination of ammonium - Part 1: Manual spectrometric method
status: valid
status modified: 2025-08-25
accepted date: 2025-08-25
in scheme: Analysmetod

ISO_TS_15923_2_2017
type: Concept
definition: ISO/TS 15923-2:2017 Water quality - Determination of selected parameters by discrete analysis systems -- Part 2: Chromium(VI), fluoride, total alkalinity, total hardness, calcium, magnesium, iron, iron(II), manganese and aluminium with photometric detection
status: valid
status modified: 2025-08-25
accepted date: 2025-08-25
in scheme: Analysmetod

ISO_TS_17182_2014
type: Concept
definition: ISO/TS 17182:2014 Soil quality - Determination of some selected phenols and chlorophenols -- Gas chromatographic method with mass spectrometric detection
status: valid
status modified: 2025-08-25
accepted date: 2025-08-25
in scheme: Analysmetod

ITM_PFAS
type: Concept
definition: ITM-PFAS Undersökningar av biota. Vätskekromatografimasspektrometri(LC/MS-MS). Kvantifieringen utfördes genom att matris liknande den som skaanalyseras tillsattes referenssubstans i olika mängd och sedan extraherades och upparbetades somproven. Responsen för proven jämfördes sedan med responsen för de spikade matriserna.
status: valid
status modified: 2025-08-25
accepted date: 2025-08-25
in scheme: Analysmetod

IVL_A10
type: Concept
definition: IVL-metod A10 för bestämning av metylkvicksilver i sediment/jord utförs med en analysmetod som bygger på ”EPA-1630”, primär separation genom destillation följt av etylering i vattenfas, gaskromatografisk separation och atomfluorescensspektrometri
status: valid
status modified: 2025-08-25
accepted date: 2025-08-25
in scheme: Analysmetod

IVL_A12
type: Concept
definition: IVL-metod A12 för analys av kvicksilver i biota. Upparbetning och analys följer IVL:s metod A12: Bestämning av kvicksilver med AFS. Fasta prover uppsluts i en blandning av koncentrerad HNO3/H2SO4 med återloppskokning. För att säkerställa fullständig oxidation till Hg(II) behandlas provet dessutom med extra oxidationsmedel och späds sedan med SQ-vatten. Därefter reduceras kvicksilvret till Hg0 med reduktionsmedel och samlas upp på guldfälla genom purge and trap-metod med N2 som bärgas, följt av dubbel guld-amalgamering och detektering med Cold Vapour Atomic Fluorescence Spectroscopy (CV-AFS)
status: valid
status modified: 2025-08-25
accepted date: 2025-08-25
in scheme: Analysmetod

IVL_A19
type: Concept
definition: IVL-metod A19 för analys av PCB7, PBDE, DDT och HCB i biota. Upparbetning och analys av samtliga ämnen följer IVL:s metod A19: Gaskromatografisk bestämning av PCB (verifierad mot SS-EN 16167:2018+AC:2019 och till EN ISO 6468:1996). 10 g provmaterial väges in och spikas med internstandard. Prover extraheras i 15 ml aceton i två omgångar och med pentan:eter (9:1) i två omgångar i ultraljudsbad (15 min/gång), vätske/vätske-extraheras med pentan:eter (9:1), upprenas med svavelsyrabehandling och fraktioneras genom en aluminiumoxidkolonn innan analys. Analysen utförs på en gaskromatograf (GC) där olika ämnen separeras på en kapillärkolonn innan de detekteras på en elektroninfångnings-detektor, ECD. Analyterna kvantifieras mot en kalibrerkurva och analysens riktighet kontrolleras med referenslösningar med känd halt. Utbyten korrigeras med hjälp av internstandarden
status: valid
status modified: 2025-08-25
accepted date: 2025-08-25
in scheme: Analysmetod

IVL_FLOT
type: Concept
definition: IVL method IVL-FLOT - Determination of flotation chemicals used in the mining industry was carried out using a liquid chromatography-mass spectrometer (LC-MS/MS). Sample volume was extracted using solid-phase extraction (SPE) columns with a WAX phase (Cleanert PWAX, Phenomenex, WA1506), then eluted with 5/95 (v/v) ammonia (25%)/methanol, and analyzed using an Acquity UPLC BEH C18 column. Final analysis was performed on a Shimadzu LCMS-8050 system, including two gradient pumps (LC-40D x3), an autosampler (SIL-40C X3), and a column oven (CTO-40C). The flow rate was set to 0.3 mL/min, and the injection volume was 4 µL. The gradient program consisted of A: MQ-water with 0.12% ammonia (25%) and B: ACN
status: valid
status modified: 2025-08-25
accepted date: 2025-08-25
in scheme: Analysmetod

IVL_MESILOX
type: Concept
definition: IVL-MESILOX. Slamundersökningar - Bestämning av siloxaner med GC-MS. Proven analyseras med purge&trap, termal desorption och GC-MS-SIR ienlighet med IVL-rapport B1643 (http://www3.ivl.se/rapporter/pdf/B1643.pdf)
status: valid
status modified: 2025-08-25
accepted date: 2025-08-25
in scheme: Analysmetod

IVL_PAH
type: Concept
definition: IVL-PAH - Determination of PAH components was carried out using a high performance liquid chromatograph (HPLC, type Agilent 1290, with a 3 μm C18-column (Pursuit PAH 100* 3 mm, Agilent). A linear gradient elution program was used, starting with acetonitrile/water 50:50 and ending with 100% acetonitrile (Rathburne HPLC-grade). A fluorescence detector (Agilent 1260) with a wavelength program optimised for each PAH was used for quantification. The peak heights were registered with a chromatographic system from Thermo (Chromeleon 7.0). The concentrations of 16 different PAH compounds were calculated by comparison to a certified standard, NIST, SRM 1647f (Priority Pollutant Polycyclic Aromatic Hydrocarbons in Acetonitrile)
status: valid
status modified: 2025-08-25
accepted date: 2025-08-25
in scheme: Analysmetod

IVL_PFAS_BIOTA
type: Concept
definition: IVL-PFAS BIOTA. IVL-metod för bestämning av PFAS i biota. 1 g homogeniserat prov vägs in. En blandning av isotopinmärkta internstandarder som motsvarar de ämnen som skall analyseras tillsätts till varje prov, med en tillsatt mängd av 10 ng per ämne. Proverna ekvilibreras sedan vid rumstemperatur i 30 minuter före extraktion i ultraljudsbad med 2 × 5 ml metanol. Extrakten kombineras och koncentreras till 1 ml under kvävgas följt av ett uppreningssteg via tillsats av 25 mg aktivt kol (graphitized carbon black, GCB). Partiklarna avlägsnas genom centrifugering. Sedan tas 0,5 ml av provet och tillsätts till 0,5 ml lösning av ammoniumacetat i vatten. Ämnen som faller ut efter denna tillsats avlägsnas genom centrifugering innan proverna analyseras med vätskekromatografi med masspektrometrisk detektion
status: valid
status modified: 2025-08-25
accepted date: 2025-08-25
in scheme: Analysmetod

IVL_TENNORG
type: Concept
definition: IVL-Tennorganiska - A six point calibration curve was prepared by diluting Organotin mix 8 stock solution (LGC Promochem) to which fresh solutions of monophenyltin trichloride and diphenyltin dichloride in methanol had been added. After ethylation using sodium tetraethylborate water was added and the ethylates extracted with hexane. Instrumental analysis was carried out using a 7890A gas chromatograph connected to a 7010 triple quadrupole mass spectrometer (Agilent) used in electron ionization and multiple reaction monitoring (MRM) mode. For most compounds two MRMs were recorded, one as a quantifier and the other as a qualifier to increase specificity
status: valid
status modified: 2025-08-25
accepted date: 2025-08-25
in scheme: Analysmetod

IVL_YES
type: Concept
definition: IVL-YES: Vattenundersökningar - Bestämning av östrogena effekter. Proven extraheras med fast fas-extraktion, elueras med aceton, överförs genom lösningsmedels-utbyte till dimetylsulfoxid och detekteras med fotometri i enlighet med IVL-rapport B 1483 (https://www.ivl.se/download/18.343dc99d14e8bb0f58b7414/1445515503373/B1483.pdf)
status: valid
status modified: 2025-08-25
accepted date: 2025-08-25
in scheme: Analysmetod

Journ_of_Chrom-PEST_modifierad
type: Concept
definition: Journal of Chromatography A 1217 (2010) 2933–2939 (modifierad). Development of a simple extraction and clean-up procedure for determination of organochlorine pesticides in soil using gas chromatography–tandem mass spectrometry
status: valid
status modified: 2025-08-25
accepted date: 2025-08-25
in scheme: Analysmetod

LECO_RC612_TOC
type: Concept
definition: LECO RC612 Temperature-dependent determination of Total Organic Carbon (TOC) in Soil, Rock, and Shale using LECO RC612 analysis. The temperature-dependent method requires no sample pretreatment and no additional sample preparation. With the assumption that organic species decompose to CO2 between 150 oC to 450 oC, and inorganic species below 1000 oC, heating to these specific temperatures in an oxidizing environment allows differentiation of the TOC from the Total Inorganic Carbon (TIC).
status: valid
status modified: 2025-08-25
accepted date: 2025-08-25
in scheme: Analysmetod

MACHNAGEL_1993_11
type: Concept
definition: Macherey-Nagel 1993-11 Bestämning av pentaklorfenol med GC_MS
status: valid
status modified: 2025-08-25
accepted date: 2025-08-25
in scheme: Analysmetod

MADEP_2004_rev_1_1
type: Concept
definition: MADEP 2004, rev. 1.1 - Method for the determination of extractable petroleum hydrocarbons (eph)
status: valid
status modified: 2025-08-25
accepted date: 2025-08-25
in scheme: Analysmetod

NEN_5756
type: Concept
definition: NEN 5756 Soil - Determination of organic and total carbon in soil after dry combustion ("Element analysis")
status: valid
status modified: 2025-08-25
accepted date: 2025-08-25
in scheme: Analysmetod

Nrf2_AREc32
type: Concept
definition: Nrf2-AREc32: Effektbaserad analys av Nrf2 ("transcription factor: nuclear factor erythroid-2-related factor 2")-aktivitet som ett mått på oxidativ stress med luciferas gen-expression i celler från cellinjen AREc32 med ursprung från humana bröstcancer-celler. Biotest med cell-linjen AREc32 baseras på induktion av de Nrf2-ARE-medierade oxidativa stress-respons reaktionerna vilka är responsiva för många kemikalier som orsakar oxidativ stress, t.ex. ett stort antal pesticider och hud-irriterande ämnen. Cellinjen är stabilt transfekterad med "antioxidant response element" (ARE) samt en luciferas-reportergen. Mätbart ljus emitteras i respons till Nrf2-aktivitet och detekteras av spektrofotometer
status: valid
status modified: 2025-08-25
accepted date: 2025-08-25
in scheme: Analysmetod

MoLab_LAKEM_MIKROFOR
type: Concept
definition: MoLab (Laboratorium för organisk spåranalys vid Högskolan Kristianstad, Krinova Incubator & Science Park). Bestämning av läkemedel och mikroföreningar - Multimetod för analys av mikroföroreningar (såsom läkemedelsrester, bekämpningsmedel och PFAS) i vatten och slam. Provet, som lagrats i frys fram till analys, tinas. Vattenproverna surgörs och upparbetas med Solid Phase Extraktion (SPE). Slutanalys sker med kromatografi (tre metoder på tre kolonner; sur, basisk och neutral) i kombination med masspektrometri (UPLC-MS/MS). Varje analyserat ämne har optimerats till respektive kromatografisk metod med avseende på känslighet och separerbarhet. Metoden utförs enligt "Whole water analysis", d v s hela provet analyseras utan filtrering, vilket efterfrågas på EUs Watchlist. Metoden är inte ackrediterad, men validerad mot standardmetod 1694 (US EPA, 2007). Mikroföroreningar i slam extraheras med ultraljud och vidare provupparbetning sker med SPE. Slutanalys sker med UPLC-MS/MS enligt ovan beskrivna metod
status: valid
status modified: 2025-08-25
accepted date: 2025-08-25
in scheme: Analysmetod

NMKL_160_1998_modifierad
type: Concept
definition: NMKL 160-1998 (modifierad), (Nordic Committee on Food Analysis, NMKL) Fat. Determination in foods. The sample is boiled in dilute hydrochloric acid in order to, among other things, liberate bound fat and convert salts of fatty acids to free acids. After filtration and gentle drying, the residue is extracted with petroleum ether or hexane. The solvent is distilled off and the mass of the residue determined. This method describes a standardised procedure for the determination of the total fat content in foods after extraction. It is a general method applicable to most solid foods with the exception of pure milk products and food fats. The results of the method performance study gave acceptable results for sausage, gruel powder, cheese, biscuits, potato chips and ice cream. For fish, oats and banana/avocado, however, the results from the study were unacceptable. See also section 12. The extracted fat may be analysed for fatty acid composition. For other normal determinations made on fat more careful extraction methods must be used
status: valid
status modified: 2025-08-25
accepted date: 2025-08-25
in scheme: Analysmetod

NMKL_161_1998_modifierad
type: Concept
definition: NMKL 161-1998 (modifierad), (Nordic Committee on Food Analysis, NMKL) Metals. Determination by atomic absorption spectrophotometry after wet digestion in a microwave oven. This method describes quantitative determination of the metals: lead, cadmium, zinc, copper and iron in various types of foods, with the exception of oils, fats and extremely fatty products. The method employs atomic absorption spectrophotometry (AAS) after microwave oven digestion under pressure. The method has been tested on dry materials only, but may under certain conditions be used for samples containing water. The sample is wet digested with nitric acid and hydrogen peroxide in a sealed container heated by microwaves. The sample solution is diluted with water and the concentrations of the metals are determined by flame or graphite furnace AAS. (Recommended by Codex as type III method)
status: valid
status modified: 2025-08-25
accepted date: 2025-08-25
in scheme: Analysmetod

ORU_MTM_EOF_SLAM
type: Concept
definition: Analysmetod för Extraherbart Organiskt Fluor (EOF) i slam (Örebro universitet (ORU), Forskningscentrum Människa-Teknik-Miljö (MTM). 0,5 g torrsubstans (TS) extraheras med metanol och upprenas med ENVI-Carb. Analys utförs med förbränningsjonkromatografi (CIC)
status: valid
status modified: 2025-08-25
accepted date: 2025-08-25
in scheme: Analysmetod

ORU_MTM_PFAS_SLAM
type: Concept
definition: Analysmetod för PFAS i slam (Örebro universitet (ORU), Forskningscentrum Människa-Teknik-Miljö (MTM). 0,5 g torrsubstans (TS) extraheras med metanol och upprenas med ENVI-Carb. Märkta standarder tillsätts före och efter extraktion. Analys utförs med UPLC-MS/MS
status: valid
status modified: 2025-08-25
accepted date: 2025-08-25
in scheme: Analysmetod

ORU_MTM_PFAS_UtgVatt
type: Concept
definition: Analysmetod för PFAS i utgående vatten från reningsverk och avlopp (Örebro universitet (ORU), Forskningscentrum Människa-Teknik-Miljö (MTM). Utgående vatten (effluent) pH-justeras till 4 och filtreras genom 1 µm glasfiberfilter. 250 ml extraheras med mix-mode svag anjonbytare (WAX). Märkta standarder tillsätts före och efter extraktion och provet injiceras både på UPLC-MS/MS och SFC-MS/MS för analys
status: valid
status modified: 2025-08-25
accepted date: 2025-08-25
in scheme: Analysmetod

PFAS_VERREAULT_2007
type: Concept
definition: Analys av PFAS enligt metoden i "Verreault et al., Trends of Perfluorinated Alkyl Substances in Herring Gull Eggs from Two Coastal Colonies in Northern Norway: 1983−2003, Environmental Science & Technology, 2007, 41, 6671-6677"
status: valid
status modified: 2025-08-25
accepted date: 2025-08-25
in scheme: Analysmetod

PI_MA_M_02_024_2019_09
type: Concept
definition: PI-MA-M 02-024: 2019-09, GBA Gesellschaft für Bioanalytik mbH In-house method - Determination of selected active substances of plant protection products by LC-MS/MS in water and soil
status: valid
status modified: 2025-08-25
accepted date: 2025-08-25
in scheme: Analysmetod

PREN_17505_2020
type: Concept
definition: prEN 17505:2020 Soil and waste characterization - Temperature dependent differentiation of total carbon (TOC400, ROC, TIC900)
status: valid
status modified: 2025-08-25
accepted date: 2025-08-25
in scheme: Analysmetod

PSA_MM_MERC
type: Concept
definition: PSA Millennium Merlin mercury. Determination of mercury by utilising atomic fluorescence as a detection technique with a Millennium Merlin mercury analyser from P S Analytical. The Millennium Merlin is linear to 10ppm. Typical applications include environmental samples such as ground water, drinking water, food stuffs (e.g. milk, fish & tea), soils & sludges, biological samples (e.g. urine, blood and hair), industrial samples such as effluent, aluminium, zinc electrolytes, paper, incineration ash, sodium hypocholite, caustic soda, fly ash, sulfur, brine and petrochemical chemical samples including; naphthas, crude oil, condensates, formation waters and other petrochemcial products
status: valid
status modified: 2025-08-25
accepted date: 2025-08-25
in scheme: Analysmetod

Pb_TOT
type: Concept
definition: Pb was determined by monitoring 208Pb in high resolution using ICP-HRMS
status: valid
status modified: 2025-08-25
accepted date: 2025-08-25
in scheme: Analysmetod

QUANT_BLACK_CARBON
type: Concept
definition: Metod beskriven i "Gustafsson et al., 2001. Evaluation of a protocol for the quantification of black carbon in sediments. Global Biogeochemical Cycles, 15, 881-890."
status: valid
status modified: 2025-08-25
accepted date: 2025-08-25
in scheme: Analysmetod

QuEChERS
type: Concept
definition: QuEChERS ("quick, easy, cheap, effective, rugged, and safe"). Solid-phase extraction method for detection of pesticide residues in food. The sample (fruits, vegetables, tobacco, etc.) is homogenized and centrifuged with a reagent and agitated for 1 minute. The reagents used depend on the type of sample to be analyzed. Following this, the sample is put through a dispersive solid phase extraction cleanup prior to analysis by gas-liquid chromatography or liquid-liquid chromatography. F. J. Schenck and J. E. Hobbs (July 2004). "Evaluation of the Quick, Easy, Cheap, Effective, Rugged, and Safe (QuEChERS) Approach to Pesticide Residue Analysis". Bulletin of Environmental Contamination and Toxicology. New York: Springer. 73 (1): 24–30. doi:10.1007/s00128-004-0388-y
status: valid
status modified: 2025-08-25
accepted date: 2025-08-25
in scheme: Analysmetod

RPS_ETHINYL_ESTRADIOL
type: Concept
definition: RPS Mountainheath Ltd analytical method of ethinyl estradiol in water. Solid Phase Extraction is followed by fraction collection and analysis on LC-MS/MS in multiple reaction monitoring mode (MRM)
status: valid
status modified: 2025-08-25
accepted date: 2025-08-25
in scheme: Analysmetod

SAKNAS
type: Concept
definition: Saknas, information ej tillgänglig
status: valid
status modified: 2025-08-25
accepted date: 2025-08-25
in scheme: Analysmetod

SCA90
type: Concept
definition: SCA90
status: valid
status modified: 2025-08-25
accepted date: 2025-08-25
in scheme: Analysmetod

SGS_4500_C_D_modifierad_MOLYBDAT_SI
type: Concept
definition: SGS Std.Met. 4500-C,D modifierad Vattenundersökningar - Bestämning av molybdatreaktivt kisel vilket analyserar mängden löst kisel. Uppslutning med ? och analys med ?
status: valid
status modified: 2025-08-25
accepted date: 2025-08-25
in scheme: Analysmetod

SGS_Aqua_Ref_MA_12
type: Concept
definition: SGS Aqua-Ref MA 12. Analyspaket SGS Analytics - Bestämning av läkemedelsrester i vatten med LC/MS
status: valid
status modified: 2025-08-25
accepted date: 2025-08-25
in scheme: Analysmetod

SGS_BEK4
type: Concept
notation: Bättre definierad SGS KMO-96 ska användas i stället
definition: SGS BEK4 Vattenundersökningar - Bestämning av 4 bekämpningsmedel (Atrazin, Diuron, Simazin, Isoproturon) i vatten med LC-MS-MS. Samma metod som den mer detaljerade SGS KMO-96 vilken bör användas i stället!
status: valid
status modified: 2025-08-25
accepted date: 2025-08-25
in scheme: Analysmetod
giltighet: Ogiltig

SGS_BEK_SPE_LVI-GC-MS
type: Concept
definition: SGS-BEK-SPE-LVI-GC-MS Analysmetod SGS Analytics - Vattenundersökningar: Bestämning av bekämpningsmedel (bl.a. kinoxifen, bifenox och cypermetrin) i vatten. Efter fast-fas-extraktion (SPE) utförs analys med gaskromatograf med stor injektionsvolym ("Large Volume Injection", LVI) och masspektrometer (LVI-GC-MS)
status: valid
status modified: 2025-08-25
accepted date: 2025-08-25
in scheme: Analysmetod

SGS_BIOTA_PBDE
type: Concept
definition: SGS-Biota Fisk/Skaldj-DIOXIN Analyspaket SGS Analytics Biota - Bestämning av 17 PCDD/PCDF samt WHO-PCDD/F-TEQ med GC-MS-MS (2,4,4’-TrBDE #28, 2,2’,4,4’-TeBDE #47, 2,2’,4,4’,5-PnBDE #99, 2,2’,4,4’,6-PnBDE #100, 2,2’,4,4’,5,6’-HxBDE #154, 2,2’,4,4’,5,5’-HxBDE #153, 2,2’,3,4,4’,5’,6-HpBDE #183, DekaBDE #209)
status: valid
status modified: 2025-08-25
accepted date: 2025-08-25
in scheme: Analysmetod

SGS_BIOTA_PBDE_PAH
type: Concept
definition: SGS-Biota-PBDE-PAH. Analyspaket SGS Analytics Biota - Bestämning av PBDE och PAH i biota. Prov extraheras med ultraljudsextraktion med ett opolärt lösningsmedel. Därefter sker olika reningssteg med diverse sorbenter (silica, NH2). Innan extraktion spikas proven med märkta internstandarder för att kompensera för förluster och matriseffekter (isotopspädning).Analys sker sedan med GC-APCI-MS-MS
status: valid
status modified: 2025-08-25
accepted date: 2025-08-25
in scheme: Analysmetod

SGS_BIOTA_PFAS05
type: Concept
definition: SGS-Biota-PFAS05 Analyspaket SGS Analytics Biota - Bestämning av 21 PFAS med LC-MS-MS (Perfluorbutansulfonat (PFBS), Perfluorpentansulf, (PFPeS), Perfluorhexansulfonat(PFHxS), Perfluorheptansulfonat (PFHpS), PFOS linjär, PFOS grenad, PFOS total, Perfluorpentansyra (PFPeA), Perfluorhexansyra (PFHxA), Perfluorheptansyra (PFHpA), PFOA linjär, PFOA grenad, PFOA total, Fluortelomersulfonat., (4:2 FTS), Fluortelomersulfonat (6:2 FTS), Fluortelomersulfonat (8:2 FTS), Perfluorbutansyra (PFBA), Perfluornonansyra (PFNA), Perfluordekansyra (PFDA), Perfluorundekansyra (PFUnDA), Perfluordodekansyra (PFDoDA), Perfluoroktansulfonamid PFOSA, 7H-Dodekafluorheptansyra HPFHpA)
status: valid
status modified: 2025-08-25
accepted date: 2025-08-25
in scheme: Analysmetod

SGS_KMLi_4
type: Concept
definition: SGS KMLi-4 Bestämning av vattenhalt, askhalt och ICP i livsmedel och foder. Vattenhalt och askhalt bestäms gravimetriskt genom torkning vid 102-105°C respektive inaskning vid 550 ± 25°C. Baserad på NMKL (f.d. "Nordisk Metodikkomité for Næringsmidler", från 2022 ändrat till "Nordic-Baltic Committee on Food Analysis") Nr 23 Utgåva 3, 1991 - Vatten och aska. Gravimetrisk bestämning i kött och köttvaror
status: valid
status modified: 2025-08-25
accepted date: 2025-08-25
in scheme: Analysmetod

SGS_KMO_107
type: Concept
definition: SGS KMO-107: Analysmetod SGS Analytics - Kvantitativ bestämning av läkemedelsrester i vatten genom direktinjektion av 50 µl prov på vätskekromatograf med trippel kvadrupol masspektrometer (LC-QQQ)
status: valid
status modified: 2025-08-25
accepted date: 2025-08-25
in scheme: Analysmetod

SGS_KMO_38
type: Concept
definition: SGS KMO-38 Analysmetod SGS Analytics - Bestämning av polyaromatiska kolväten (PAH), låga halter, i sediment. Prov extraheras med ultraljudsbad med cyklohexan/aceton och analyseras sedan med GC-ECD
status: valid
status modified: 2025-08-25
accepted date: 2025-08-25
in scheme: Analysmetod

SGS_KMO_65
type: Concept
definition: SGS KMO-65: Analysmetod SGS Analytics - Bestämning av polybromerade difenyletrar (PBDE) enligt EU:s vattendirektiv (2000/60/EG) samt dotterdirektiv (2008/105/EG), samt bestämning av hexabromcyklododekan (HBCD) och Tetrabrombisfenol A (TBBPA) i biota. Analys sker med GC-MS-MS
status: valid
status modified: 2025-08-25
accepted date: 2025-08-25
in scheme: Analysmetod

SGS_KMO_66
type: Concept
definition: SGS KMO-66 Vattenundersökningar - Bestämning av klorparaffiner C10-C13 (SCCP) med (LVI)-GC/MS NCI med extraktion diklormetan
status: valid
status modified: 2025-08-25
accepted date: 2025-08-25
in scheme: Analysmetod

SGS_KMO_69_20
type: Concept
definition: SGS KMO-69: Analysmetod SGS Analytics - Upparbetning av förbränningsprover, vattenprover och fasta prover för bestämning av PCDD/F (polyklorerade dibensodioxiner och -furaner), PBDD/F (polybromerade dibensodioxiner och -furaner) och PCB (polyklorerade bifenyler) för vidare bestämning enligt metod SGS KMO-20. Kvantitativ bestämning med GC-MS med högupplösande masspektrometri eller med trippelkvadrupolteknik
status: valid
status modified: 2025-08-25
accepted date: 2025-08-25
in scheme: Analysmetod

SGS_KMO_82
type: Concept
definition: SGS KMO-82 Vattenundersökningar – Fenoler i Vattenmatriser med (LVI)-GC/MS NCI efter derivatisering
status: valid
status modified: 2025-08-25
accepted date: 2025-08-25
in scheme: Analysmetod

SGS_KMO_90
type: Concept
definition: SGS KMO-90 Vattenundersökningar – Bestämning av glyfosat och AMPA i vatten med on-line SPE och LC-QQQ
status: valid
status modified: 2025-08-25
accepted date: 2025-08-25
in scheme: Analysmetod

SGS_KMO_91
type: Concept
definition: SGS KMO-91 Vattenundersökningar - Bestämning av bekämpningsmedel i vatten och jord/sediment med on-line SPE och LC-QQQ
status: valid
status modified: 2025-08-25
accepted date: 2025-08-25
in scheme: Analysmetod

SGS_KMO_94
type: Concept
definition: SGS KMO-94: Analysmetod SGS Analytics - Bestämning av 16 PAH-föreingar, samt penta- och hexaklorbensen i biota. Extraktion sker med ultraljud följt av rening med fast fas-extraktion (SPE) med NH2-kolonn. Analysen sker med LVI-GC-EI-MS-MS
status: valid
status modified: 2025-08-25
accepted date: 2025-08-25
in scheme: Analysmetod

SGS_KMO_99
type: Concept
definition: SGS KMO-99: Analysmetod SGS Analytics - Bestämning av per- och polyfluorerade föreningar (PFAS) i vatten, jord, biota, avfall (betong/asfalt), sediment och slam med LC-MS-MS. Fasta materialen bereds innan analys med en basisk metanolextraktion
status: valid
status modified: 2025-08-25
accepted date: 2025-08-25
in scheme: Analysmetod

SGS_KMO_dikofol
type: Concept
definition: SGS KMO-Dikofol Vattenundersökningar - Bestämninmg av Dikofol genom vätske-vätske-extraktion och analys med gaskromatografi och tandemmasspektrometri, GC-MS-MS (liquid-liquid extraction with injection on GC-MS-MS)
status: valid
status modified: 2025-08-25
accepted date: 2025-08-25
in scheme: Analysmetod

SGS_MET_0973
type: Concept
definition: SGS Analytics analysmetod MET-0973 för bestämning av alkoholer. Vatten: Alkoholer analyseras direkt med HS-GC-MS efter tillsats av internstandard 2-metyl-2-butanol. Glykoler anrikas med SPE, ENVI-Carb, vilka elueras med diklormetan.Jord, slam, sediment: Fast material extraheras med vatten efter tillsats av internstandard 2-metyl-2-butanol. Följer därefter samma procedur som för vattenprov
status: valid
status modified: 2025-08-25
accepted date: 2025-08-25
in scheme: Analysmetod

SGS_NL_EOX
type: Concept
definition: SGS NL EOX: SGS NL analysmetod för bestämning av extraherbara organiskt bundna halogener; F, Cl, Br. Extraktion sker med hexan vilken uppkoncentreras genom indunstning varefter extraktet analyseras med mikrocoulometer
status: valid
status modified: 2025-08-25
accepted date: 2025-08-25
in scheme: Analysmetod

SGS_NL_LVI-GC-MS
type: Concept
definition: SGS NL-LVI-GC-MS: Analysmetod SGS Analytics - Analys av klorerade pesticider. Lösningsmedelsextraktion och analys med gaskromatograf med stor injektionsvolym ("Large Volume Injection") och masspektrometer (LVI-GC-MS)
status: valid
status modified: 2025-08-25
accepted date: 2025-08-25
in scheme: Analysmetod

SGS_PAH16
type: Concept
definition: SGS-PAH 16 Vattenundersökningar - Bestämning av 16 PAH med GC-MS ((Naftalen, Acenaftylen, Acenaften, Fluoren, Fenantren, Antracen, Fluoranten, Pyren, Benso[a]antracen, Krysen/Trifenylen, Benso[b]fluoranten, Benso[k]fluoranten, Benso[a]pyren, Dibenso[a,h]antracen, Benso[ghi]perylen, Indeno[1,2,3-cd]pyren)
status: valid
status modified: 2025-08-25
accepted date: 2025-08-25
in scheme: Analysmetod

SGS_PAH_SED
type: Concept
definition: SGS Analytics analysmetod för PAH i sediment. Extraktion sker vanligtvis med mikrovågsassisterad extraktion (MAE) där hexan/aceton (1:1 v/v) används som lösningsmedel. Innan extraktion tillsätts isotopmärkta standarder för att kompensera för eventuella förluster under provets gång. Kraftigt förorenade extrakt renas med SPE (aminopropyl). Analys sker med GC-MS
status: valid
status modified: 2025-08-25
accepted date: 2025-08-25
in scheme: Analysmetod

SGS_KMO_96
type: Concept
definition: SGS KMO-96 Bestämning av bekämpningsmedel och bronopol i vatten och bronopol i sediment med direktinjektion och LC-QQQ. De flesta bekämpningsmedel som analyseras med LC-MS-MS saknar fastfas-upparbetning. Vattnet mäts upp direkt i vial. Tillsatser tillsätts i vialen, sedan analyseras provet med analysinstrumentet LC-QQQ. Det här gäller bla Atrazin, Diuron, Simazin, Isoproturon (BEK4) men även t.ex. 2,4-diklorfenoxisyra, 2,4-diklorprop, BAM, Bentazon, Bitertanol, Boskalid, Bronopol, Cyanazin, Desetylatrazin, Desetylterbutylazin, Desisopropylatrazin, Dimetoat, Etofumesat, Fluroxipyr, Imidakloprid, Klopyralid, Kloridazon, Kvinmerak, MCPA, Mekoprop, Metalaxyl, Metamitron, Metazaklor, Metribuzin, Metsulfuronmetyl, Pirimikarb, Propyzamid, Sulfosulfuron, Terbutylazin, Thifensulfuronmetyl, Tribenuronmetyl
status: valid
status modified: 2025-08-25
accepted date: 2025-08-25
in scheme: Analysmetod

SGS_SIS_CEN_TR_16998_2016_modifierad
type: Concept
definition: SGS Analytics analys enligt SIS-CEN/TR 16998:2016 (modifierad). Utomhusluft - Rapport om nitro- och oxy-PAH; - ursprung, toxicitet, halter och mätmetoder. Fast material extraheras, efter tillsats av isotopmärkta OxyPAH som internstandard, med en mix av aceton/hexan med sonikering, MAE eller soxhlet. Extrakt torkas med natriumsulfat och indunstas. Bestämning sker med GC-MS alt. GC-MS-MS
status: valid
status modified: 2025-08-25
accepted date: 2025-08-25
in scheme: Analysmetod

SGS_STD_MET_1998_20_4500_C_D_modifierad
type: Concept
definition: SGS Analytics Standard Methods 1998 utgåva 20, metod 4500-C,D (modifierad) efter metod 941003 från Limnologiska institutionen, SLU, Uppsala. Vattenundersökningar - Bestämning av molybdatreaktivt kisel vilket analyserar mängden löst kisel. Prover tillsätts reagens och analyseras med spektrofotometer. Prover t.o.m. 2022-01-31
status: valid
status modified: 2025-08-25
accepted date: 2025-08-25
in scheme: Analysmetod

SGS_STD_MET_2017_23_4500_SiO2_C_D_modifierad
type: Concept
definition: SGS Analytics Standard Methods 2017 utgåva 23, metod 4500-SiO2 C, D (modifierad) efter metod 941003 från Limnologiska institutionen, SLU, Uppsala. Vattenundersökningar - Bestämning av molybdatreaktivt kisel vilket analyserar mängden löst kisel. Prover tillsätts reagens och analyseras med spektrofotometer. Prover från 2022-02-01
status: valid
status modified: 2025-08-25
accepted date: 2025-08-25
in scheme: Analysmetod

SGS_TOPASSAY_PFAS
type: Concept
definition: SGS Analytics TOP (Total Oxidisable Precursors)-assay för PFAS. Bestämning av PFAS i vatten före och efter oxidation med kaliumperoxid och efterföljande analys med LC-QQQ
status: valid
status modified: 2025-08-25
accepted date: 2025-08-25
in scheme: Analysmetod

SIS_CEN_TR_16192_2020
type: Concept
definition: SIS-CEN/TR 16192:2020 Karaktärisering av avfall - Analys av lakvatten
status: valid
status modified: 2025-08-25
accepted date: 2025-08-25
in scheme: Analysmetod

SIS_CEN_TS_16183_2013
type: Concept
definition: SIS-CEN/TS 16183:2013 Sludge, treated biowaste and soil – Determination of selected phthalates using capillary gas chromatography with mass spectrometric detection (GC-MS). Publicerad/Published: 2013-09-12Utgåva/Edition: 1, Språk/Language: engelska/English, CS: 13.030.01
status: valid
status modified: 2025-08-25
accepted date: 2025-08-25
in scheme: Analysmetod

SIS_TK_535_N_012
type: Concept
definition: SIS/TK 535 N 012 Instruktion för analys av fraktionen Aromater >C16-C35
status: valid
status modified: 2025-08-25
accepted date: 2025-08-25
in scheme: Analysmetod

SLU-AQUA_ALGTOX
type: Concept
definition: SLU AQUA analysis of algal toxins. Extraction with mixture of iso-hexane, iso-propanol, and diethyl ether (3:5:1), 25 mL) was followed by derivatisation. A tetrabutylammonium (TBA) carbonate buffer (1.5 mL) made by dissolving sodium carbonate (Na2CO3; 4.24 g) and tetrabutyl ammonium hydrogen sulfate (TBAHSO4; 6.8 g) in water (100 mL) was added to the sample. Acetic acid anhydride (50 µL) was then added and the sample was mixed for 1 min, by shaking by hand. This process was repeated once more with an additional portion of acetic acid anhydride (50 µL). When the reaction was finalised, the organic solvent was isolated and reduced to 100 µL under a stream of nitrogen gas prior to instrumental analysis by MS-ENCI with methane as buffer gas
status: valid
status modified: 2025-08-25
accepted date: 2025-08-25
in scheme: Analysmetod

SLU_HG
type: Concept
definition: SLU-Hg analysis. The analyses of mercury were done according to May and Stoeppler, and Lindsted and Skare using a double-beam spectrophotometer. May, K. & Stoeppler, M. Pretreatment studies with biological and environmental materials. Fresenius J Anal Chem 317, 248–251 (1984). Lindsted, G. & Skare, I. Microdetermination of mercury in biological samples. Analyst 96, 223–229 (1971)
status: valid
status modified: 2025-08-25
accepted date: 2025-08-25
in scheme: Analysmetod

SLU_METALLER_AAS
type: Concept
definition: SLU-Metallanalys 1989-01 – 1995-07. Vid bestämningen av metaller skedde en direkt injicering av surgjort ofiltrerat vattenprov (0.5 ml HNO3/100 ml, SS 02 81 83). Analysen utfördes med en Philips PU 9200 Atomabsorptionsspektrometer med grafitugn och med en Philips PU 9390 elektrotermisk atomiserare och autosampler (The quantification of metals was conducted on a Philips PU 9200 Atomic Absorption Spectrophotometer with a graphite furnace and with a Philips PU 9390 electrothermal atomizer and autosampler) Enligt: Borg, H., Edin, A. & Sköld, E. Determination of metals in fish livers by flameless atomic absorption spectroscopy. Water Res (1981)
status: valid
status modified: 2025-08-25
accepted date: 2025-08-25
in scheme: Analysmetod

SLU_METALLER_ICP-MS
type: Concept
definition: SLU-Metallanalys 1995-08 – 2007-08. Vid bestämningen av metaller skedde en direkt injicering av surgjort ofiltrerat vattenprov (0.5 ml HNO3/100 ml). Analysen utfördes med en Perkin-Elmer ELAN 6000 ICP-MS masspektrometrer
status: valid
status modified: 2025-08-25
accepted date: 2025-08-25
in scheme: Analysmetod

SLU_OMK_51
type: Concept
definition: SLU-OMK 51. Multimetod för analys av opolära och semipolära pesticider i vatten. 500 g prov tas ut och internstandard tillsätts före vätske-vätske-extraktion med diklormetan. Organfasen torkas med natriumsulfat och koncentreras till 1 ml slutvolym. Extrakten analyseras med gaskromatograf med massspektrometrisk bestämning (GC-MS och GC-MS-MS) och med en kapillärkolonn för MS-detektor, längd 30 m, i.d. 0,25 mm, fastjocklek 0,25 µm (t.ex. HP-5MS). Beräkningar av koncentrationer (ca 32 analyter) görs med utvärderingsprogrammet MassHunter 10. Kalibreringskurvor med standard-mixar av certifierade substanser används vid beräkningarna
status: valid
status modified: 2025-08-25
accepted date: 2025-08-25
in scheme: Analysmetod

SLU_PFAS
type: Concept
definition: SLU-PFAS. Determination of PFAS using ultra performance liquid chromatography - tandem mass spectrometer (UPLC-MS-MS). After extraction, the extract was transferred to a polypropylene centrifuge tube and stored in -20 °C for 12 h. Thereafter the supernatant was concentrated under a gentle steam of nitrogen. Graphitised carbon with acetic acid was added to the concentrated extract for clean-up. Treated extract was evaporated under nitrogen stream until dryness and methanol was added. Aliquots of the final extracts were injected on a liquid chromatography (LC) system coupled to a tandem mass spectrometer
status: valid
status modified: 2025-08-25
accepted date: 2025-08-25
in scheme: Analysmetod

SLV_K2_M261_F3_modifierad
type: Concept
definition: SLV K2-m261-f3 (modifierad) (Livsmedelsverket). Bestämning av PAH i livsmedel. Analyterna analyserades med gaskromatografisk separation kopplad till elektroninfångnings-detektor (GC-ECD) med duala kapillärkolonner
status: valid
status modified: 2025-08-25
accepted date: 2025-08-25
in scheme: Analysmetod

SLV_m063_f2
type: Concept
definition: Metod SLV-m063-f2 (Livsmedelsverket). Bestämning av organiska klorföreningar i ägg. Analyterna analyserades med gaskromatografisk separation kopplad till elektroninfångnings-detektor (GC-ECD)
status: valid
status modified: 2025-08-25
accepted date: 2025-08-25
in scheme: Analysmetod

SLV_m063_f3
type: Concept
definition: Metod SLV-m063-f3 (Livsmedelsverket). Bestämning av organiska klorföreningar i livsmedel. Analyterna analyserades med gaskromatografisk separation kopplad till elektroninfångnings-detektor (GC-ECD)
status: valid
status modified: 2025-08-25
accepted date: 2025-08-25
in scheme: Analysmetod

SLU_OMK_57
type: Concept
definition: SLU-OMK 57. Multimetod för analys av olika polära och semipolära analyter i yt-, regn- och grundvatten. pH i provet justeras till cirka pH 5,0. Till provet sätts 2% metanol och internstandard före filtrering (0,2 µm sprutfilter, regenererad cellulosa) innan analys. Automatisk koncentrering och analys med vätskekromatograf med masspektrometrisk bestämning (LC-MS-MS). Förkoncentreringskolonner (typ Strata C18, 20 µm 20x2 mm, Strata X, 25 µm 20x2 mm i serie), analyskolonn för reversed phase (ex Eclipse Plus C18, 3,0x100 mm). HPLC (Agilent 1260 eller 1290) och LC-MS-MS med elektrospray-interface, ES+, (Agilent 6470). Beräkningar av koncentrationer (ca 110 analyter) görs med utvärderingsprogrammet MassHunter 10. Kalibreringskurvor med standard-mixar av certifierade substanser används vid beräkningarna
status: valid
status modified: 2025-08-25
accepted date: 2025-08-25
in scheme: Analysmetod

SLU_OMK_58
type: Concept
definition: SLU-OMK 58. Metod för analys av fenoxisyror och andra sura analyter i vatten med LC-MS-MS. pH i provet justeras till cirka pH 2,5 med myrsyra. Till provet sätts 2% metanol och internstandard före filtrering (0,2 µm sprutfilter, regenererad cellulosa) innan analys. Automatisk koncentrering och analys med vätskekromatograf med masspektrometrisk bestämning (LC-MS-MS). Förkoncentreringskolonner (t.ex. Spark PLRP, 20 µm 20x2 mm), analyskolonn för reversed phase (ex Eclipse Plus C18, 3,0x100 mm). HPLC (Agilent 1260 eller 1290) och LC-MS-MS med elektrospray-interface, ES-, (Agilent 6470). Beräkningar av koncentrationer (ca 20 analyter) görs med utvärderingsprogrammet MassHunter 10. Kalibreringskurvor med standard-mixar av certifierade substanser används vid beräkningarna
status: valid
status modified: 2025-08-25
accepted date: 2025-08-25
in scheme: Analysmetod

SLV_m064_f3
type: Concept
definition: Metod SLV-m064-f3 (Livsmedelsverket). Bestämning av bromerade flamskyddsmedel i livsmedel. Analyterna analyserades med gaskromatografisk separation kopplad till masspektrometer (GC-MS)
status: valid
status modified: 2025-08-25
accepted date: 2025-08-25
in scheme: Analysmetod

SLV_m064_f4
type: Concept
definition: Metod SLV-m064-f4 (Livsmedelsverket). Bestämning av bromerade flamskyddsmedel i ägg. Analyterna analyserades med gaskromatografisk separation kopplad till masspektrometer (GC-MS)
status: valid
status modified: 2025-08-25
accepted date: 2025-08-25
in scheme: Analysmetod

SM_3112
type: Concept
definition: SM 3112 Standard Methods for the Examination of Water and Wastewater - Metals by cold-vapor atomic absorption spectrometry
status: valid
status modified: 2025-08-25
accepted date: 2025-08-25
in scheme: Analysmetod

SM_3120
type: Concept
definition: SM 3120 Standard Methods for the Examination of Water and Wastewater - Metals in Water by Plasma Emission Spectroscopy
status: valid
status modified: 2025-08-25
accepted date: 2025-08-25
in scheme: Analysmetod

SM_5310
type: Concept
definition: SM 5310 Standard Methods for the Examination of Water and Wastewater - Determination of Total Organic Carbon (TOC)
status: valid
status modified: 2025-08-25
accepted date: 2025-08-25
in scheme: Analysmetod

SNV3829
type: Concept
definition: SNV 3829 Provtagnings- och analysmetoder för slam från kommunala avloppsreningsverk. Sverige. Statens naturvårdsverk (medarbetare) ISBN 916203829X Svenska 38 s. Serie: Rapport / Naturvårdsverket, 0282-7298 ; 3829 Publicerad: Solna : Naturvårdsverket, 1990
status: valid
status modified: 2025-08-25
accepted date: 2025-08-25
in scheme: Analysmetod

SNV_3829_modifierad
type: Concept
definition: SNV 3829 (modifierad) Provtagnings- och analysmetoder för slam från kommunala avloppsreningsverk. Sverige. Statens naturvårdsverk (medarbetare) ISBN 916203829X Svenska 38 s. Serie: Rapport / Naturvårdsverket, 0282-7298 ; 3829 Publicerad: Solna : Naturvårdsverket, 1990
status: valid
status modified: 2025-08-25
accepted date: 2025-08-25
in scheme: Analysmetod

SPI_REK_2010
type: Concept
definition: SPI Rekommendation: Efterbehandling av förorenade bensinstationer och dieselanläggningar (2010). Rekommendationerna har tagits fram genom samarbete mellan SPI Miljösaneringsfond AB,SPIMFAB, och oljebolagen i Sverigehttps://drivkraftsverige.se/wp-content/uploads/2018/05/SPBI-rek_ebh-fororenade-bensinst-dieselanl_uppdaterad20120129.pdf
status: valid
status modified: 2025-08-25
accepted date: 2025-08-25
in scheme: Analysmetod

SS-EN-ISO-IEC_17025
type: Concept
definition: SS-EN-ISO/IEC 17025
status: valid
status modified: 2025-08-25
accepted date: 2025-08-25
in scheme: Analysmetod

SS-EN_13506_modifierad
type: Concept
definition: SS-EN 13506 (modifierad) Vattenundersökningar - Bestämning av kvicksilver med atomfluorescens spektrometri
status: valid
status modified: 2025-08-25
accepted date: 2025-08-25
in scheme: Analysmetod

SS-EN_13805
type: Concept
definition: SS-EN 13805 Foodstuffs - Determination of trace elements - Pressure digestion
status: valid
status modified: 2025-08-25
accepted date: 2025-08-25
in scheme: Analysmetod

SS-EN_ISO_17294-2-2005
type: Concept
definition: SS-EN ISO 17294-2:2005 Vattenundersökningar - Bestämning med induktivt kopplad plasma och masspektrometri (ICP-MS) - Del 2: Bestämning av 62 grundelement (ISO 17294-2:2003)
status: valid
status modified: 2025-08-25
accepted date: 2025-08-25
in scheme: Analysmetod

SS-EN_ISO_17852-2008
type: Concept
definition: SS-EN ISO 17852:2008
status: valid
status modified: 2025-08-25
accepted date: 2025-08-25
in scheme: Analysmetod

SS-EN_ISO_7027_1_2016
type: Concept
definition: SS-EN ISO 7027-1:2016 Vattenundersökningar - Bestämning av turbiditet - Del 1: Kvantitativa metoder (ISO 7027-1:2016)
status: valid
status modified: 2025-08-25
accepted date: 2025-08-25
in scheme: Analysmetod

SS-ISO_16772_utg-1
type: Concept
definition: SS-ISO 16772, utg-1 Markundersökningar - Bestämning av kvicksilver i kungsvattenextrakt av jord med användning av flamlös atomabsorptionsspektrofotometri och atomfluorescensspektrofotometri (ISO 16772:2004, IDT)
status: valid
status modified: 2025-08-25
accepted date: 2025-08-25
in scheme: Analysmetod

SS028150_2
type: Concept
definition: Vattenundersökningar - Bestämning av metaller med atomabsorptionsspektrometri i flamma - Allmänna principer och regler
status: valid
status modified: 2025-08-25
accepted date: 2025-08-25
in scheme: Analysmetod

SS11885_1
type: Concept
definition: SS11885-1 (SS-EN ISO 11885) Vattenundersökningar - Bestämning av 33 grundelement genom atomemissionsspektroskopi med induktivt kopplad plasma (ISO 11885:1996). Utgåva 1
status: valid
status modified: 2025-08-25
accepted date: 2025-08-25
in scheme: Analysmetod

SS_028101_1
type: Concept
definition: SS 028101, utg-1 Vattenundersökningar - Nitrogenhalt i vatten - Bestämning med kjeldahlmetod efter reduktion med Devardas legering
status: valid
status modified: 2025-08-25
accepted date: 2025-08-25
in scheme: Analysmetod

SS_028145_4
type: Concept
definition: SS 028145, utg-4 Vattenundersökningar - Bestämning av olja i vatten
status: valid
status modified: 2025-08-25
accepted date: 2025-08-25
in scheme: Analysmetod

SS_028175
type: Concept
definition: SS 028175 Vattenundersökningar - Metallhalt i vatten, slam och sedimentBestämning med flamlös atomabsorptionsspektrofotometri- Speciella anvisningar för kvicksilver
status: valid
status modified: 2025-08-25
accepted date: 2025-08-25
in scheme: Analysmetod

SS_028175_1_modifierad
type: Concept
definition: SS 028175-1 (modifierad) - Vattenundersökningar - Metallhalt i vatten, slam och sedimentBestämning med flamlös atomabsorptionsspektrofotometri- Speciella anvisningar för kvicksilver
status: valid
status modified: 2025-08-25
accepted date: 2025-08-25
in scheme: Analysmetod

SS_028183_1
type: Concept
definition: Svensk standard SS 028183, utgåva 1 (tidigare SS 02 81 83-1), 1986-05-20. Vattenundersökningar – Metallhalt i vatten, slam och sediment – Bestämning med flamlös atomabsorptionsspektrofotometri – Elektrotermisk atomisering i grafitugn – Allmänna principer och regler
status: valid
status modified: 2025-08-25
accepted date: 2025-08-25
in scheme: Analysmetod

SS_02_81_13_1
type: Concept
definition: SS 02 81 13-1 (numera SS 28113-1) Vattenundersökningar - Bestämning av torrsubstans och glödgningsrest i vatten, slam och sediment
status: valid
status modified: 2025-08-25
accepted date: 2025-08-25
in scheme: Analysmetod

SS_02_83_11_samt_SS-ISO_10391
type: Concept
definition: SS 02 83 11 samt SS-ISO 10391
status: valid
status modified: 2025-08-25
accepted date: 2025-08-25
in scheme: Analysmetod

SS_12673
type: Concept
definition: SS 12673 Vattenundersökningar - Gaskromatografisk bestämning av ett antal klorfenoler i vatten
status: valid
status modified: 2025-08-25
accepted date: 2025-08-25
in scheme: Analysmetod

SS_28101
type: Concept
definition: SS 28101 Vattenundersökningar - Nitrogenhalt i vatten - Bestämning med kjeldahlmetod efter reduktion med Devardas legering
status: valid
status modified: 2025-08-25
accepted date: 2025-08-25
in scheme: Analysmetod

SS_28113_1
type: Concept
definition: SS 28113-1 Vattenundersökningar - Bestämning av torrsubstans och glödgningsrest i vatten, slam och sediment
status: valid
status modified: 2025-08-25
accepted date: 2025-08-25
in scheme: Analysmetod

SS_28118_1
type: Concept
definition: SS 28118-1 Vattenundersökningar - Bestämning av oxygenförbrukning hos vatten - CODMn oxidation med permanganat
status: valid
status modified: 2025-08-25
accepted date: 2025-08-25
in scheme: Analysmetod

SS_28122
type: Concept
definition: SS 28122 Vattenundersökningar - Bestämning av pH-värde hos vatten
status: valid
status modified: 2025-08-25
accepted date: 2025-08-25
in scheme: Analysmetod

SS_28142_modifierad
type: Concept
definition: SS 28142 (modifierad) Vattenundersökningar - Bestämning av kemisk oxygenförbrukning hos vatten- CODCr oxidation med dikromat
status: valid
status modified: 2025-08-25
accepted date: 2025-08-25
in scheme: Analysmetod

SS_28167_2
type: Concept
definition: SS 28167, utgåva 2 Vattenundersökningar - Koliforma bakterier, termotoleranta koliforma bakterier och Escherichia coli i vatten - Bestämning med membranfiltermetod (MF)
status: valid
status modified: 2025-08-25
accepted date: 2025-08-25
in scheme: Analysmetod

SS_EN_12260_2004
type: Concept
definition: SS-EN 12260:2004 Vattenundersökningar - Bestämning av totalhalten bundet kväve (TNb) efter oxidation till kväveoxider
status: valid
status modified: 2025-08-25
accepted date: 2025-08-25
in scheme: Analysmetod

SS_EN_12673
type: Concept
definition: SS-EN 12673 Vattenundersökningar - Gaskromatografisk bestämning av ett antal klorfenoler i vatten
status: valid
status modified: 2025-08-25
accepted date: 2025-08-25
in scheme: Analysmetod

SS_EN_12879
type: Concept
definition: SS-EN 12879 Karaktärisering av slam - Bestämning av torrsubstansförlust vid upphettning
status: valid
status modified: 2025-08-25
accepted date: 2025-08-25
in scheme: Analysmetod

SS_EN_12879_utg_1
type: Concept
definition: SS-EN 12879, utgåva 1 Karaktärisering av slam - Bestämning av torrsubstansförlust vid upphettning
status: valid
status modified: 2025-08-25
accepted date: 2025-08-25
in scheme: Analysmetod

SS_EN_12880
type: Concept
definition: Karaktärisering av slam - Bestämning av torrsubstans och vatteninnehåll
status: valid
status modified: 2025-08-25
accepted date: 2025-08-25
in scheme: Analysmetod

SS_EN_12880_1
type: Concept
definition: SS-EN 12880, utg-1 Karaktärisering av slam - Bestämning av torrsubstans och vatteninnehåll
status: valid
status modified: 2025-08-25
accepted date: 2025-08-25
in scheme: Analysmetod

SS_EN_12880_1_2000
type: Concept
definition: SS-EN 12880-1:2000 - Karaktärisering av slam - Bestämning av torrsubstans och vatteninnehåll
status: valid
status modified: 2025-08-25
accepted date: 2025-08-25
in scheme: Analysmetod

SS_EN_12880_1_2000_modifierad
type: Concept
definition: SS-EN 12880-1:2000 (modifierad) - Karaktärisering av slam - Bestämning av torrsubstans och vatteninnehåll
status: valid
status modified: 2025-08-25
accepted date: 2025-08-25
in scheme: Analysmetod

SS_EN_13137_modifierad
type: Concept
definition: SS-EN 13137 (modifierad) Karaktärisering av avfall - Bestämning av totala mängden organiskt kol i avfall, slam och sediment
status: valid
status modified: 2025-08-25
accepted date: 2025-08-25
in scheme: Analysmetod

SS_EN_13346_modifierad
type: Concept
definition: SS-EN 13346 (modifierad) Karaktärisering av slam - Bestämning av spårelement och fosfor - Metoder för kungsvattenextraktion
status: valid
status modified: 2025-08-25
accepted date: 2025-08-25
in scheme: Analysmetod

SS_EN_13805-2014
type: Concept
definition: SS-EN 13805:2014 - A method for the pressure digestion of foodstuffs intended for the determination of elements. This method has been collaboratively tested in combination with atomic absorption (flame, electrothermal (ET), hydride, cold-vapour) techniques and ICP-MS
status: valid
status modified: 2025-08-25
accepted date: 2025-08-25
in scheme: Analysmetod

SS_EN_14346_2007
type: Concept
definition: SS-EN 14346:2007 Karaktärisering av avfall - Beräkning av torrhalt baserad på torrsubstans och vatteninnehåll
status: valid
status modified: 2025-08-25
accepted date: 2025-08-25
in scheme: Analysmetod

SS_EN_1483_1997
type: Concept
definition: SS-EN 1483:1997 Vattenundersökningar - Bestämning av kvicksilver med atomabsorptionsspektrometri
status: valid
status modified: 2025-08-25
accepted date: 2025-08-25
in scheme: Analysmetod

SS_EN_1483_2007
type: Concept
definition: SS-EN 1483:2007 Vattenundersökningar - Bestämning av kvicksilver med atomabsorptionsspektrometri
status: valid
status modified: 2025-08-25
accepted date: 2025-08-25
in scheme: Analysmetod

SS_EN_1484_utg_1
type: Concept
definition: SS-EN 1484, utgåva-1 Vattenundersökningar - Riktlinjer för bestämning av totalt organiskt kol (TOC) och löst organiskt kol (DOC)
status: valid
status modified: 2025-08-25
accepted date: 2025-08-25
in scheme: Analysmetod

SS_EN_15934_2012
type: Concept
definition: SS-EN 15934:2012 Slam, behandlat bioavfall, mark och avfall - Beräkning av torrsubstanshalt efter bestämning av indunstningsrest eller vatteninnehåll. Utgåva: 1
status: valid
status modified: 2025-08-25
accepted date: 2025-08-25
in scheme: Analysmetod

SS_EN_15935_2012
type: Concept
definition: SS-EN 15935:2012 Slam, behandlat bioavfall, mark och avfall - Bestämning av glödförlust
status: valid
status modified: 2025-08-25
accepted date: 2025-08-25
in scheme: Analysmetod

SS_EN_15935_2021
type: Concept
definition: SS-EN 15935:2021 Slam, behandlat bioavfall, mark och avfall - Bestämning av glödförlust
status: valid
status modified: 2025-08-25
accepted date: 2025-08-25
in scheme: Analysmetod

SS_EN_15936_2012
type: Concept
definition: SS-EN 15936:2012 Slam, behandlat bioavfall, mark och avfall - Bestämning av totalt organiskt kol (TOC) med torrförbränning
status: valid
status modified: 2025-08-25
accepted date: 2025-08-25
in scheme: Analysmetod

SS_EN_15936_2012_modifierad
type: Concept
definition: SS-EN 15936:2012 (modifierad) Slam, behandlat bioavfall, mark och avfall - Bestämning av totalt organiskt kol (TOC) med torrförbränning
status: valid
status modified: 2025-08-25
accepted date: 2025-08-25
in scheme: Analysmetod

SS_EN_15936_2022
type: Concept
definition: SS-EN 15936:2022 Jord, avfall, behandlat bioavfall och slam - Bestämning av totalt organiskt kol (TOC) med torrförbränning
status: valid
status modified: 2025-08-25
accepted date: 2025-08-25
in scheme: Analysmetod

SS_EN_15936_2022_modifierad
type: Concept
definition: SS-EN 15936:2022 (modifierad) Jord, avfall, behandlat bioavfall och slam - Bestämning av totalt organiskt kol (TOC) med torrförbränning
status: valid
status modified: 2025-08-25
accepted date: 2025-08-25
in scheme: Analysmetod

SS_EN_16167_2018
type: Concept
definition: SS-EN 16167:2018 Slam, behandlat bioavfall och mark - Bestämning av polyklorerade bifenyler (PCB) genom gaskromatografi med masselektiv detektion (GC-MS) och gaskromatografi med elektroninfångningsdetektor (GC-ECD)
status: valid
status modified: 2025-08-25
accepted date: 2025-08-25
in scheme: Analysmetod

SS_EN_16167_2018_AC-2019
type: Concept
definition: SS-EN 16167:2018+AC:2019 Slam, behandlat bioavfall och mark - Bestämning av polyklorerade bifenyler (PCB) genom gaskromatografi med masselektiv detektion (GC-MS) och gaskromatografi med elektroninfångningsdetektor
status: valid
status modified: 2025-08-25
accepted date: 2025-08-25
in scheme: Analysmetod

SS_EN_16167_2018_modifierad
type: Concept
definition: SS-EN 16167:2018 (modifierad) Slam, behandlat bioavfall och mark - Bestämning av polyklorerade bifenyler (PCB) genom gaskromatografi med masselektiv detektion (GC-MS) och gaskromatografi med elektroninfångningsdetektor (GC-ECD)
status: valid
status modified: 2025-08-25
accepted date: 2025-08-25
in scheme: Analysmetod

SS_EN_16169_2012
type: Concept
definition: SS-EN 16169:2012 Slam, behandlat bioavfall och mark - Bestämning av kväve med Kjeldahlmetoden
status: valid
status modified: 2025-08-25
accepted date: 2025-08-25
in scheme: Analysmetod

SS_EN_16171_2016
type: Concept
definition: SS-EN 16171:2016 Slam, behandlat bioavfall och mark - Bestämning av grundämnen med induktivt kopplad plasma och masspektrometri
status: valid
status modified: 2025-08-25
accepted date: 2025-08-25
in scheme: Analysmetod

SS_EN_16173_2012
type: Concept
definition: SS-EN 16173:2012 Slam, behandlat bioavfall och mark - Uppslutning av salpetersyralösliga fraktioner av grundämnen
status: valid
status modified: 2025-08-25
accepted date: 2025-08-25
in scheme: Analysmetod

SS_EN_16175_1_2016_modifierad
type: Concept
definition: SS-EN 16175-1:2016 (modifierad) Slam, behandlat bioavfall och mark - Bestämning av kvicksilver - Del 1: Atomabsorptionsspektrometri med kall ånga (CV-AAS)
status: valid
status modified: 2025-08-25
accepted date: 2025-08-25
in scheme: Analysmetod

SS_EN_16181_2018_modifierad
type: Concept
definition: SS-EN 16181:2018 (modifierad) Slam, behandlat bioavfall och mark - Bestämning av polycykliska aromatiska kolväten (PAH) med gaskromatografi (GC) och högupplösande vätskekromatografi (HPLC)
status: valid
status modified: 2025-08-25
accepted date: 2025-08-25
in scheme: Analysmetod

SS_EN_16190_2019
type: Concept
definition: SS-EN 16190:2019 Slam, behandlat bioavfall och mark - Bestämning av dioxiner och furaner och dioxin-lika polyklorerade bifenyler med högupplösande masspektrometri kopplat med gaskromatografi (HR GC-MS)
status: valid
status modified: 2025-08-25
accepted date: 2025-08-25
in scheme: Analysmetod

SS_EN_16190_2019_modifierad
type: Concept
definition: SS-EN 16190:2019 (modifierad) Slam, behandlat bioavfall och mark - Bestämning av dioxiner och furaner och dioxin-lika polyklorerade bifenyler med högupplösande masspektrometri kopplat med gaskromatografi (HR GC-MS)
status: valid
status modified: 2025-08-25
accepted date: 2025-08-25
in scheme: Analysmetod

SS_EN_16192_2011
type: Concept
definition: SS-EN 16192:2011 Karaktärisering av avfall - Analys av lakvatten
status: valid
status modified: 2025-08-25
accepted date: 2025-08-25
in scheme: Analysmetod

SS_EN_16215_2020
type: Concept
definition: SS-EN 16215:2020 Djurfoder - Provtagnings- och analysmetoder - Bestämning av dioxiner och dioxinlika PCB:er med GC/HRMS och av indikator-PCB:er med GC/HRMS
status: valid
status modified: 2025-08-25
accepted date: 2025-08-25
in scheme: Analysmetod

SS_EN_16277_2012
type: Concept
definition: SS-EN 16277:2012 Djurfoder - Bestämning av kvicksilver med ”cold-vapour” atom absorption spektrometri (CVAAS) efter uppslutning under tryck i mikrovågsugn (extraktion med 65 % salpetersyra och 30 % väteperoxid)
status: valid
status modified: 2025-08-25
accepted date: 2025-08-25
in scheme: Analysmetod

SS_EN_16691-2015
type: Concept
definition: SS-EN 16691:2015
status: valid
status modified: 2025-08-25
accepted date: 2025-08-25
in scheme: Analysmetod

SS_EN_16691_2015
type: Concept
definition: SS-EN 16691:2015 Vattenundersökningar - Bestämning av några utvalda polycykliska aromatiska kolväten (PAH) i vattenprover - Gaskromatografisk och masspektrometrisk metod (GC-MS) efter fastfasextraktion (SPE diskar)
status: valid
status modified: 2025-08-25
accepted date: 2025-08-25
in scheme: Analysmetod

SS_EN_16693-2015
type: Concept
definition: SS-EN 16693:2015
status: valid
status modified: 2025-08-25
accepted date: 2025-08-25
in scheme: Analysmetod

SS_EN_16693_2015
type: Concept
definition: SS-EN 16693:2015 Vattenundersökningar - Bestämning av organoklorerade pesticider (OCP) i vattenprover - Gaskromatografisk och masspektrometrisk metod (GC-MS) efter fastfasextraktion (SPE diskar)
status: valid
status modified: 2025-08-25
accepted date: 2025-08-25
in scheme: Analysmetod

SS_EN_17322_2020
type: Concept
definition: SS-EN 17322:2020 Fasta miljömatriser -Bestämning av polyklorerade bifenyler (PCB) genom gaskromatografi med masselektiv detektion (GC-MS) eller med elektroninfångningsdetektor (GC-ECD)
status: valid
status modified: 2025-08-25
accepted date: 2025-08-25
in scheme: Analysmetod

SS_EN_17503_2022
type: Concept
definition: SS-EN 17503:2022 Jord, slam, behandlat bioavfall och avfall - Bestämning av polycykliska aromatiska kolväten (PAH) med gaskromatografi (GC) och högupplösande vätskekromatografi (HPLC)
status: valid
status modified: 2025-08-25
accepted date: 2025-08-25
in scheme: Analysmetod

SS_EN_1948
type: Concept
definition: SS-EN 1948 Utsläpp och utomhusluft - Masskoncentrationsbestämning av PCDD/PCDF
status: valid
status modified: 2025-08-25
accepted date: 2025-08-25
in scheme: Analysmetod

SS_EN_26777_1
type: Concept
definition: SS-EN 26777-1 Vattenundersökningar - Bestämning av nitrit - Spektrofotometrisk metod
status: valid
status modified: 2025-08-25
accepted date: 2025-08-25
in scheme: Analysmetod

SS_EN_27888_1_1985
type: Concept
definition: SS-EN 27888-1:1985 Vattenundersökningar - Bestämning av konduktivitet (ISO 7888:1985)
status: valid
status modified: 2025-08-25
accepted date: 2025-08-25
in scheme: Analysmetod

SS_EN_872_2_2005
type: Concept
definition: SS-EN 872-2:2005 Vattenundersökningar - Bestämning av suspenderade ämnen - Metod baserad på filtrering genom glasfiberfilter
status: valid
status modified: 2025-08-25
accepted date: 2025-08-25
in scheme: Analysmetod

SS_EN_ISO_10304_1_2009
type: Concept
definition: SS-EN ISO 10304-1:2009 Vattenundersökningar - Bestämning av lösta anjoner med jonkromatografi - Del 1: Bestämning av bromid, klorid, fluorid, nitrat, nitrit, fosfat och sulfat (ISO 10304-1:2007)
status: valid
status modified: 2025-08-25
accepted date: 2025-08-25
in scheme: Analysmetod

SS_EN_ISO_10304_4_1999
type: Concept
definition: SS-EN ISO 10304-4:1999 Vattenundersökningar - Bestämning av lösta anjoner med jonkromatografi - Del 4: Bestämning av klorat, klorid och klorit i vatten med låg föroreningsgrad (ISO 10304-4:1997)
status: valid
status modified: 2025-08-25
accepted date: 2025-08-25
in scheme: Analysmetod

SS_EN_ISO_10523
type: Concept
definition: SS-EN ISO 10523
status: valid
status modified: 2025-08-25
accepted date: 2025-08-25
in scheme: Analysmetod

SS_EN_ISO_10523_2012
type: Concept
definition: SS-EN ISO 10523:2012 Vattenundersökningar - Bestämning av pH-värde i vatten (ISO 10523:2008)
status: valid
status modified: 2025-08-25
accepted date: 2025-08-25
in scheme: Analysmetod

SS_EN_ISO_11348_3_2008_A1_2019_modifierad
type: Concept
definition: SS-EN ISO 11348-3:2008/A1:2019 (modifierad) Vattenundersökningar - Bestämning av vattenprovers hämmande effekt på emissionen av ljus hos Vibrio fischeri (Test med luminiscerande bakterier) - Del 3: Metod som använder frystorkade bakterier (ISO 11348-3:2007/Amd 1:2018)
status: valid
status modified: 2025-08-25
accepted date: 2025-08-25
in scheme: Analysmetod

SS_EN_ISO_11732_2005
type: Concept
definition: SS-EN ISO 11732:2005 Vattenundersökningar - Bestämning av ammoniumkväve genom flödesanalys (CFA och FIA) och spektrometrisk detektion (ISO 11732:2005)
status: valid
status modified: 2025-08-25
accepted date: 2025-08-25
in scheme: Analysmetod

SS_EN_ISO_11885-2-2009
type: Concept
definition: SS-EN ISO 11885-2:2009
status: valid
status modified: 2025-08-25
accepted date: 2025-08-25
in scheme: Analysmetod

SS_EN_ISO_11885_1
type: Concept
definition: SS-EN ISO 11885, utg-1 Vattenundersökningar – Bestämning av 33 grundelement genom atomemissions-spektroskopi med induktivt kopplad plasma (ISO 11885:1996)
status: valid
status modified: 2025-08-25
accepted date: 2025-08-25
in scheme: Analysmetod

SS_EN_ISO_11885_2009
type: Concept
definition: SS-EN ISO 11885:2009 Vattenundersökningar - Bestämning av ett antal utvalda grundämnen genom atomemissionsspektrometri med induktivt kopplad plasma (ICP-AES) (ISO 11885:2007)
status: valid
status modified: 2025-08-25
accepted date: 2025-08-25
in scheme: Analysmetod

SS_EN_ISO_11885_2013
type: Concept
definition: SS-EN ISO 11885-2013 Vattenundersökningar - Bestämning av ett antal utvalda grundämnen genom atomemissionsspektrometri med induktivt kopplad plasma (ICP-AES)
status: valid
status modified: 2025-08-25
accepted date: 2025-08-25
in scheme: Analysmetod
editorial note: 2013 års version verkar ej finnas i SIS, bara i Östeuropa /Turkiet

SS_EN_ISO_11885_modifierad
type: Concept
definition: SS EN ISO 11885 (modifierad)
status: valid
status modified: 2025-08-25
accepted date: 2025-08-25
in scheme: Analysmetod

SS_EN_ISO_11905_1_1998
type: Concept
definition: SS-EN ISO 11905-1:1998 Vattenundersökningar - Bestämning av nitrogen - Del 1: Oxidativ uppslutning med peroxodisulfat (ISO 11905-1:1997)
status: valid
status modified: 2025-08-25
accepted date: 2025-08-25
in scheme: Analysmetod

SS_EN_ISO_13395_1997
type: Concept
definition: SS-EN ISO 13395:1997 Vattenundersökningar - Bestämning av nitritkväve, nitratkväve och summan av båda genom flödesanalys (CFA och FIA) och spektrometrisk detektion (ISO 13395:1996)
status: valid
status modified: 2025-08-25
accepted date: 2025-08-25
in scheme: Analysmetod

SS_EN_ISO_14403_2_2012
type: Concept
definition: SS-EN ISO 14403-2:2012 Vattenundersökningar - Vattenundersökningar - Bestämning av totalhalt cyanid och fri cyanid genom flödesanalys (FIA och CFA) - Del 2: Metod med kontinuerlig flödesanalys (CFA) (ISO 14403-2:2012)
status: valid
status modified: 2025-08-25
accepted date: 2025-08-25
in scheme: Analysmetod

SS_EN_ISO_15192_2021
type: Concept
definition: SS-EN ISO 15192:2021 Karaktärisering av mark och avfall - Bestämning av krom (VI) i fast material genom alkalisk uppslutning och jonkromatografi med spektrofotometrisk detektion (ISO 15192:2021)
status: valid
status modified: 2025-08-25
accepted date: 2025-08-25
in scheme: Analysmetod

SS_EN_ISO_15587_2_2002
type: Concept
definition: SS-EN ISO 15587-2:2002 Vattenundersökningar - Uppslutning för bestämning av utvalda grundelement i vatten - Del 2: Uppslutning med salpetersyra (ISO 15587-2:2002)
status: valid
status modified: 2025-08-25
accepted date: 2025-08-25
in scheme: Analysmetod

SS_EN_ISO_15681_2_2018
type: Concept
definition: SS-EN ISO 15681-2:2018 Vattenundersökningar - Bestämning av ortofosfat och totalhalt fosfor genom flödesanalys (FIA och CFA) - Del 2: Metod med kontinuerligt flöde (ISO 15681-2:2018)
status: valid
status modified: 2025-08-25
accepted date: 2025-08-25
in scheme: Analysmetod

SS_EN_ISO_16264_2004
type: Concept
definition: SS-EN ISO 16264:2004 Vattenundersökningar - Bestämning av lösliga silikater med flödesanalys (FIA och CFA) och fotometrisk detektion (ISO 16264:2002)
status: valid
status modified: 2025-08-25
accepted date: 2025-08-25
in scheme: Analysmetod

SS_EN_ISO_16703_2011
type: Concept
definition: SS-EN ISO 16703:2011 Markundersökningar - Bestämning av kolväten inom intervallet C10 till C40 med gaskromatografi (ISO 16703:2004)
status: valid
status modified: 2025-08-25
accepted date: 2025-08-25
in scheme: Analysmetod

SS_EN_ISO_16720-2007
type: Concept
definition: SS-EN ISO 16720:2007 - Förbehandling av prover genom frystorkning för efterföljande analys
status: valid
status modified: 2025-08-25
accepted date: 2025-08-25
in scheme: Analysmetod

SS_EN_ISO_17291-1_modifierad
type: Concept
definition: SS EN ISO 17291-1 (modifierad)
status: valid
status modified: 2025-08-25
accepted date: 2025-08-25
in scheme: Analysmetod

SS_EN_ISO_17294-1_2_modifierad
type: Concept
definition: SS EN ISO 17294-1 och -2 (modifierad) Vattenundersökningar - Bestämning med induktivt kopplad plasma och masspektrometri (ICP-MS) - Del 1: Allmän vägledning. Del 2: Bestämning av 62 grundelement
status: valid
status modified: 2025-08-25
accepted date: 2025-08-25
in scheme: Analysmetod

SS_EN_ISO_17294-2-2016
type: Concept
definition: SS-EN ISO 17294-2:2016 - Application of inductively coupled plasma mass spectrometry (ICP-MS) - Part 2: Determination of selected elements including uranium isotopes
status: valid
status modified: 2025-08-25
accepted date: 2025-08-25
in scheme: Analysmetod

SS_EN_ISO_17294-2_2023
type: Concept
definition: SS-EN ISO 17294-2:2023 Vattenundersökningar - Bestämning med induktivt kopplad plasma och masspektrometri (ICP-MS) - Del 2: Bestämning av ett antal utvalda grundelement och isotoper av uran (ISO 17294-2:2023)
status: valid
status modified: 2025-08-25
accepted date: 2025-08-25
in scheme: Analysmetod

SS_EN_ISO_17294_1_2006
type: Concept
definition: SS-EN ISO 17294-1:2006 Vattenundersökningar - Bestämning med induktivt kopplad plasma och masspektrometri (ICP-MS) - Del 1: Allmän vägledning (ISO 17294-1:2004)
status: valid
status modified: 2025-08-25
accepted date: 2025-08-25
in scheme: Analysmetod

SS_EN_ISO_17353_2005
type: Concept
definition: SS-EN ISO 17353:2005 Vattenundersökningar - Bestämning av ett urval organiska tennföreningar med gaskromatografi (ISO 17353:2004)
status: valid
status modified: 2025-08-25
accepted date: 2025-08-25
in scheme: Analysmetod

SS_EN_ISO_17852_2008
type: Concept
definition: SS-EN ISO 17852:2008 Vattenundersökningar - Bestämning av kvicksilver med atomfluorescensspektrometri (ISO 17852:2006)
status: valid
status modified: 2025-08-25
accepted date: 2025-08-25
in scheme: Analysmetod

SS_EN_ISO_17852_2008_modifierad
type: Concept
definition: SS-EN ISO 17852:2008 (modifierad) Vattenundersökningar - Bestämning av kvicksilver med atomfluorescensspektrometri (ISO 17852:2006)
status: valid
status modified: 2025-08-25
accepted date: 2025-08-25
in scheme: Analysmetod

SS_EN_ISO_18412-2006
type: Concept
definition: SS EN ISO 18412:2006 Vattenundersökningar - Bestämning av krom (VI) - Fotometrisk metod för låga koncentrationer (ISO 18412:2005)
status: valid
status modified: 2025-08-25
accepted date: 2025-08-25
in scheme: Analysmetod

SS_EN_ISO_18412-2006_modifierad
type: Concept
definition: SS EN ISO 18412:2006 (modifierad) Vattenundersökningar - Bestämning av krom (VI) - Fotometrisk metod för låga koncentrationer (ISO 18412:2005)
status: valid
status modified: 2025-08-25
accepted date: 2025-08-25
in scheme: Analysmetod

SS_EN_ISO_18856_2005_modifierad
type: Concept
definition: SS-EN ISO 18856:2005 (modifierad) Vattenundersökningar - Bestämning av ett urval ftalater med gaskromatografi och masspektrometri (ISO 18856:2004)
status: valid
status modified: 2025-08-25
accepted date: 2025-08-25
in scheme: Analysmetod

SS_EN_ISO_20236_2021
type: Concept
definition: SS-EN ISO 20236:2021 Vattenundersökningar - Bestämning av totalt organiskt kol (TOC), upplöst organiskt kol (DOC), bundet kväve (TNb) och upplöst bundet kväve (DNb) efter katalytisk oxidativ förbränning vid hög temperatur (ISO 20236:2018)
status: valid
status modified: 2025-08-25
accepted date: 2025-08-25
in scheme: Analysmetod

SS_EN_ISO_21676_2021
type: Concept
definition: SS-EN ISO 21676:2021 Vattenundersökningar - Bestämning av utvalda aktiva läkemedelskomponenter, nedbrytningsprodukter och andra organiska substanser lösta i vatten och utgående avloppsvatten - HPLC-MS/MS eller HPLC-HRMS metod med direktinjektion (ISO 21676:2018)
status: valid
status modified: 2025-08-25
accepted date: 2025-08-25
in scheme: Analysmetod

SS_EN_ISO_22155_2013_modifierad
type: Concept
definition: SS-EN ISO 22155:2013 (modifierad) - Analysmetod för Aromatiska kolväten
status: valid
status modified: 2025-08-25
accepted date: 2025-08-25
in scheme: Analysmetod

SS_EN_ISO_22155_2016
type: Concept
definition: SS-EN ISO 22155:2016 Markundersökingar - Gaskromatografisk bestämning av flyktiga aromatiska och halogenererade kolväten och vissa etrar - Statisk Headspace metod (ISO 22155:2016)
status: valid
status modified: 2025-08-25
accepted date: 2025-08-25
in scheme: Analysmetod

SS_EN_ISO_22155_2016_modifierad
type: Concept
definition: SS-EN ISO 22155:2016 (modifierad) - Markundersökingar - Gaskromatografisk bestämning av flyktiga aromatiska och halogenererade kolväten och vissa etrar - Statisk Headspace metod (ISO 22155:2016)
status: valid
status modified: 2025-08-25
accepted date: 2025-08-25
in scheme: Analysmetod

SS_EN_ISO_23161_2011
type: Concept
definition: SS-EN ISO 23161:2011 Soil quality - Determination of selected organotin compounds - Gas-chromatographic method (ISO 23161:2009)
status: valid
status modified: 2025-08-25
accepted date: 2025-08-25
in scheme: Analysmetod

SS_EN_ISO_23161_2018
type: Concept
definition: SS-EN ISO 23161:2018 Markundersökningar - Bestämning av vissa organiska tennföreningar - Metod med gas-kromatografi (ISO 23161:2018)
status: valid
status modified: 2025-08-25
accepted date: 2025-08-25
in scheme: Analysmetod

SS_EN_ISO_23161_modifierad
type: Concept
definition: SS-EN ISO 23161 (modifierad)
status: valid
status modified: 2025-08-25
accepted date: 2025-08-25
in scheme: Analysmetod

SS_EN_ISO_5667_3_2018
type: Concept
definition: SS-EN ISO 5667-3:2018 Vattenundersökningar - Provtagning - Del 3: Riktlinjer för konservering och hantering av vattenprover (ISO 5667-3:2018)
status: valid
status modified: 2025-08-25
accepted date: 2025-08-25
in scheme: Analysmetod

SS_EN_ISO_6222
type: Concept
definition: SS-EN ISO 6222 Vattenundersökningar - Bestämning av odlingsbara mikroorganismer - Koloniräkning genom ingjutning i ett näringssubstrat med agar (ISO 6222:1999)
status: valid
status modified: 2025-08-25
accepted date: 2025-08-25
in scheme: Analysmetod

SS_EN_ISO_6878_2005
type: Concept
definition: SS-EN ISO 6878:2005 Vattenundersökningar - Bestämning av fosfor - Spektrofotometrisk metod med ammoniummolybdat (ISO 6878:2004)
status: valid
status modified: 2025-08-25
accepted date: 2025-08-25
in scheme: Analysmetod

SS_EN_ISO_7887_2012_C_modifierad
type: Concept
definition: SS-EN ISO 7887:2012, del C (modifierad) Vattenundersökningar - Undersökning och bestämning av färg (ISO 7887:2011)
status: valid
status modified: 2025-08-25
accepted date: 2025-08-25
in scheme: Analysmetod

SS_EN_ISO_7899_2
type: Concept
definition: SS-EN ISO 7899-2 Vattenundersökningar - Bestämning av intestinala enterokocker - Del 2: Membranfiltermetod (ISO 7899-2:2000)
status: valid
status modified: 2025-08-25
accepted date: 2025-08-25
in scheme: Analysmetod

SS_EN_ISO_9963_2_utg_1
type: Concept
definition: SS-EN ISO 9963-2, utgåva 1 Vattenundersökningar - Bestämning av alkalinitet - Del 2: Bestämning av karbonatalkalinitet (ISO 9963-2:1994)
status: valid
status modified: 2025-08-25
accepted date: 2025-08-25
in scheme: Analysmetod

SS_ISO_10390
type: Concept
definition: SS-ISO 10390 Markundersökningar - Bestämning av pH
status: valid
status modified: 2025-08-25
accepted date: 2025-08-25
in scheme: Analysmetod

SS_ISO_11465
type: Concept
definition: SS-ISO 11465 Markundersökningar - Bestämning av torrsubstans och vattenkvot - Gravimetrisk metod
status: valid
status modified: 2025-08-25
accepted date: 2025-08-25
in scheme: Analysmetod

SS_ISO_18287_2008
type: Concept
definition: SS-ISO 18287:2008 Markundersökningar - Bestämning av polycykliska aromatiska kolväten (PAH) - Gaskromatografisk metod med masspektrometrisk detektion (GC-MS)
status: valid
status modified: 2025-08-25
accepted date: 2025-08-25
in scheme: Analysmetod

SS_ISO_18287_2008_modifierad
type: Concept
definition: SS-ISO 18287:2008 (modifierad) Markundersökningar - Bestämning av polycykliska aromatiska kolväten (PAH) - Gaskromatografisk metod med masspektrometrisk detektion (GC-MS)
status: valid
status modified: 2025-08-25
accepted date: 2025-08-25
in scheme: Analysmetod

TITRERING
type: Concept
definition: Syra-bastitrering
status: valid
status modified: 2025-08-25
accepted date: 2025-08-25
in scheme: Analysmetod

TOPASSAY_PFAS_HOUTZ_2012
type: Concept
definition: TOP (Total Oxidisable Precursors)-assay för PFAS. Bestämning av PFAS efter oxidation och efterföljande analys med LC-MS-MS. Enligt: " Houtz, E. F., Sedlak, D. L. Oxidative Conversion as a Means of Detecting Precursors to Perfluoroalkyl Acids in Urban Runoff. Environ. Sci. Technol., 2012, 46, 9342−9349"
status: valid
status modified: 2025-08-25
accepted date: 2025-08-25
in scheme: Analysmetod

TS_FRYSTO
type: Concept
definition: Bestämning av torrsubstanshalt efter frystorkning
status: valid
status modified: 2025-08-25
accepted date: 2025-08-25
in scheme: Analysmetod

UCD_SIA
type: Concept
definition: EA-IRMS (University of California, Davis campus) - Isotopkvoter av kol och kväve analyseras med en elementaranalysator kopplad till en masspektrometer för mätning av isotopkvoter. I elementaranalysatorn oxideras provet vid hög temperatur samt reduceras med CuO, varpå isotopkvoterna för de bildade gaserna (CO2 och N2) bestäms med masspektrometri. Isotopsignaturerna (d13C och d15N) beräknas utifrån isotopkvoterna i referensmaterial (Vienna PeeDee Belemnite (C) och luft (N))
status: valid
status modified: 2025-08-25
accepted date: 2025-08-25
in scheme: Analysmetod

UMU_DIOX_DL-PCB
type: Concept
definition: Dioxiner, dl-PCB (Umeå universitet) - The analyses of dioxins and dioxin-like PCB are carried out at the Department of Chemistry, Umeå University. The extraction method is described by Wiberg and co-workers [Wiberg et al., 1998], the clean-up method by Danielsson and co-workers [Danielsson et al., 2005], and the instrumental analysis (GC-HRMS) by Liljelind and co-workers [Liljelind et al., 2003]. The laboratory participates in the annual FOOD intercalibration rounds, including laboratory reference material (salmon tissue) with each set of samples
status: valid
status modified: 2025-08-25
accepted date: 2025-08-25
in scheme: Analysmetod

UMU_KEM_BEK_SED
type: Concept
definition: UMU-KEM-BEK: Umeå universitet, Kemiska institutionen. Sedimentundersökningar - Bestämning av bekämpningsmedel i sediment. Analyserna utförs med trippel kvadrupol masspektrometer kopplad till vätskekromatograf (LC-MS-QQQ) efter sekventiell extraktion av proven med: 1,5 ml metanol:vatten (7:3) med 0,1 % myrsyra; 1,5 ml acetonitril och 1,5 ml 5 % trietylamin i metanol:vatten (1:3)
status: valid
status modified: 2025-08-25
accepted date: 2025-08-25
in scheme: Analysmetod

UMU_KEM_POP
type: Concept
definition: UMU-KEM-POP: Umeå universitet, Kemiska institutionen. Slamundersökningar - Bestämning av POP-ämnen (polyklorerade dibenso-dioxiner och -furaner/polyklorerade bifenyler/klorbensener/polybromerade difenyletrar/bromerade flamskyddsmedel/klor-brom-fenoler/pesticider/m.fl.). Proven spetsas med interna standarder och extraheras med Soxhlet/Dean-Stark med toluen. Neutrala föreningar renas med syra/bas-modifirad kiselgel och kolkolonn-fraktioneras. Fenoler bas-extraheras från toluen och derivatiseras med ättikssyra-anhydrid. Analys med GC-HRMS. Enligt Environmental Science and Technology, Vol. 37, pp. 3680-3686
status: valid
status modified: 2025-08-25
accepted date: 2025-08-25
in scheme: Analysmetod

UMU_KEM_SLAM_GC
type: Concept
definition: UMU-KEM-SLAM-GC: Umeå universitet, Kemiska institutionen. Slamundersökningar - Bestämning av organofosfater, klorparaffiner, myskämnen, fenoler, biocider, bensotiasoler och UV-filter, m.fl. genom extraktion med toluen följt av GPC-fraktionering och analys med GC-HRMS
status: valid
status modified: 2025-08-25
accepted date: 2025-08-25
in scheme: Analysmetod

UMU_KEM_SLAM_LC
type: Concept
definition: UMU-KEM-SLAM-LC: Umeå universitet, Kemiska institutionen. Slamundersökningar - Bestämning av biocider, bisfenol, antibiotika och läkemedel, m.fl. genom ultraljuds-assisterad fast-fas/vätske extraktion och analys med LC-MS-MS eller GC-HRMS
status: valid
status modified: 2025-08-25
accepted date: 2025-08-25
in scheme: Analysmetod

UMU_KEM_SLAM_LC_FQ
type: Concept
definition: UMU-KEM-SLAM-LC-FQ: Umeå universitet, Kemiska institutionen. Slamundersökningar - Bestämning av fluorokinoloner. Prover spetsas med interna standarder, extraheras sekventiellt genom ultrasonikering med fosfatbuffert, pH 6 och 5 % trietylamin i metanol:vatten (25:75), och analyseras med LC-MS-MS i enlighet med Environmental Science & Technology, Vol 39, pp. 3421-3429
status: valid
status modified: 2025-08-25
accepted date: 2025-08-25
in scheme: Analysmetod

UMU_KEM_VATTEN_GC
type: Concept
definition: UMU-KEM-VATTEN-GC, Umeå universitet, Kemiska institutionen. Vattenundersökningar - Bestämning av organofosfater, myskämnen, fenoler, biocider, benzotiazoler och UV-filter, m.fl. genom vätske-vätske extraktion med toluen och analys med GC-HRMS
status: valid
status modified: 2025-08-25
accepted date: 2025-08-25
in scheme: Analysmetod

UMU_KEM_VATTEN_LC
type: Concept
definition: UMU-KEM-VATTEN-LC: Umeå universitet, Kemiska institutionen. Vattenundersökningar - Bestämning av triklosan, antibiotika, bisfenol och läkemedel genom fast-fas-extraktion (SPE, Oasis HLB 6 mL, 200 mg). Analys med LC-MS-MS eller GC-HRMS
status: valid
status modified: 2025-08-25
accepted date: 2025-08-25
in scheme: Analysmetod

US_EPA_1613
type: Concept
definition: US EPA 1613 isomer-specific determination of the 2,3,7,8-substituted, tetra through octa-chlorinated, dibenzo-p-dioxins and dibenzofurans in aqueous, solid, and tissue matrices by isotope dilution, high resolution capillary column gas chromatography (HRGC)/high resolution mass spectrometry (HRMS)
status: valid
status modified: 2025-08-25
accepted date: 2025-08-25
in scheme: Analysmetod

US_EPA_1613_modifierad
type: Concept
definition: US EPA 1613 (modifierad) Isomer-specific determination of the 2,3,7,8-substituted, tetra through octa-chlorinated, dibenzo-p-dioxins and dibenzofurans in aqueous, solid, and tissue matrices by isotope dilution, high resolution capillary column gas chromatography (HRGC)/high resolution mass spectrometry (HRMS)
status: valid
status modified: 2025-08-25
accepted date: 2025-08-25
in scheme: Analysmetod

US_EPA_1614_modifierad
type: Concept
definition: US EPA 1614 (modifierad) Brominated Diphenyl Ethers in Water Soil, Sediment and Tissue by HRGC/HRMS. Aqueous samples (samples containing less than one percent solids)-Stable isotopically labeled analogs of the BDEs are spiked into a 1-L sample. The sample is extracted using solid-phase extraction (SPE), separatory funnel extraction (SFE), or continuous liquid/liquid extraction (CLLE). Solid, semi-solid, and multi-phase samples (excluding tissue)-The labeled compounds are spiked into a sample containing 10 g (dry weight) of solids. Samples containing multiple phases are pressure filtered and any aqueous liquid is discarded. Coarse solids are ground or homogenized. Any non-aqueous liquid from multi-phase samples is combined with the solids and extracted in a Soxhlet/Dean-Stark extractor. Fish and other tissue-A 20-g aliquot of sample is homogenized, and a 10-g aliquot is spiked with the labeled compounds. The sample is mixed with anhydrous sodium sulfate, dried for a minimum of 30 minutes, and extracted for 18-24 hours using methylene chloride in a Soxhlet extractor. The extract is evaporated to dryness, and the lipid content is determined
status: valid
status modified: 2025-08-25
accepted date: 2025-08-25
in scheme: Analysmetod

US_EPA_1631_E
type: Concept
definition: US EPA 1631, Revision E: Mercury in Water by Oxidation, Purge andTrap, and Cold Vapor Atomic Fluorescence Spectrometry
status: valid
status modified: 2025-08-25
accepted date: 2025-08-25
in scheme: Analysmetod

US_EPA_1694
type: Concept
definition: US EPA 1694 - Pharmaceuticals and personal care products in water, soil, sediment, and biosolids by HPLC/MS/MS
status: valid
status modified: 2025-08-25
accepted date: 2025-08-25
in scheme: Analysmetod

US_EPA_200_7
type: Concept
definition: US EPA 200.7, revision 4.4 (1994) Determination of Metals and Trace Elements in Water and Wastes by Inductively Coupled Plasma-Atomic Emission Spectrometry
status: valid
status modified: 2025-08-25
accepted date: 2025-08-25
in scheme: Analysmetod

US_EPA_200_8
type: Concept
definition: US EPA 200.8, revision 5.4 (1994). Determination of Trace Elements in Waters and Wastes by Inductively Coupled Plasma-Mass Spectrometry
status: valid
status modified: 2025-08-25
accepted date: 2025-08-25
in scheme: Analysmetod

US_EPA_200_8_1
type: Concept
notation: Endast legacydata
definition: US EPA 200.8, utg-1: Determination of Trace Elements in Waters and Wastes by Inductively Coupled Plasma-Mass Spectrometry
status: valid
status modified: 2025-08-25
accepted date: 2025-08-25
in scheme: Analysmetod
giltighet: Ogiltig

US_EPA_3500_C
type: Concept
definition: US EPA 3500C - Organic Extraction & Sample Preparation
status: valid
status modified: 2025-08-25
accepted date: 2025-08-25
in scheme: Analysmetod

US_EPA_5021
type: Concept
definition: US EPA 5021 - Volatile organic compounds in soils and other solid matrices using equilibrium headspace analysis
status: valid
status modified: 2025-08-25
accepted date: 2025-08-25
in scheme: Analysmetod

US_EPA_5021A
type: Concept
definition: US EPA 5021A - Volatile organic compounds in various sample matrices using equilibrium headspace analysis
status: valid
status modified: 2025-08-25
accepted date: 2025-08-25
in scheme: Analysmetod

US_EPA_533
type: Concept
definition: US EPA 533 - Determination of per- and polyfluoroalkyl substances in drinking water by isotope dilution anion exchange solid phase extraction and liquid chromatography/tandem mass spectrometry
status: valid
status modified: 2025-08-25
accepted date: 2025-08-25
in scheme: Analysmetod

US_EPA_537_1
type: Concept
definition: US EPA Method 537.1: Determination of Selected Per- and Polyfluorinated Alkyl Substances in Drinking Water by Solid Phase Extraction and Liquid Chromatography/Tandem Mass Spectrometry (LC/MS/MS)
status: valid
status modified: 2025-08-25
accepted date: 2025-08-25
in scheme: Analysmetod

US_EPA_6020_modifierad
type: Concept
definition: US EPA 6020 (modifierad): Inductively Coupled Plasma - Mass Spectrometry
status: valid
status modified: 2025-08-25
accepted date: 2025-08-25
in scheme: Analysmetod

US_EPA_624
type: Concept
definition: US EPA 624 - Purgeables by GC/MS. Determination of purgeable organic pollutants in industrial discharges and other environmental samples by gas chromatography combined with mass spectrometry (GC/MS). A sample is purged with an inert gas transforming the purgeable organics to the vapor phase where it is collected on an absorbent trap at ambient temperature. After the sample is purged, the trap is then heated, backflushed, and desorbed with the inert gas onto an chromatographic column. The gas chromatograph is temperature programmed to separate the purgeable organics, which are then detected by a mass spectrometer (MS)
status: valid
status modified: 2025-08-25
accepted date: 2025-08-25
in scheme: Analysmetod

US_EPA_7473
type: Concept
definition: US EPA 7473 - Determination of mercury in solids and solutions by thermal decomposition, amalgamation, and atomic absorption spectrophotometry
status: valid
status modified: 2025-08-25
accepted date: 2025-08-25
in scheme: Analysmetod

US_EPA_8041A
type: Concept
definition: US EPA 8041A - Analysis of phenols by gas chromatography
status: valid
status modified: 2025-08-25
accepted date: 2025-08-25
in scheme: Analysmetod

US_EPA_8061A
type: Concept
definition: US EPA 8061A Phthalate esters by gas chromatography with electron capture detection (GC/ECD)
status: valid
status modified: 2025-08-25
accepted date: 2025-08-25
in scheme: Analysmetod

US_EPA_8081A
type: Concept
definition: US EPA 8081A - Analysis of organochlorine pesticides by gas chromatography
status: valid
status modified: 2025-08-25
accepted date: 2025-08-25
in scheme: Analysmetod

US_EPA_8082A
type: Concept
definition: US EPA 8082A - Analysis of polychlorinated biphenyls (PCBs) by gas chromatography
status: valid
status modified: 2025-08-25
accepted date: 2025-08-25
in scheme: Analysmetod

US_EPA_8260
type: Concept
definition: US EPA 8260 - Analysis of of volatile organic compounds (VOCs) in solid waste and water samples using purge-and-trap concentration or direct injection with GC-MS
status: valid
status modified: 2025-08-25
accepted date: 2025-08-25
in scheme: Analysmetod

US_EPA_8260_D
type: Concept
definition: US EPA 8260D - Analysis of volatile organic compounds by gas chromatography-mass spectrometry (GC/MS)
status: valid
status modified: 2025-08-25
accepted date: 2025-08-25
in scheme: Analysmetod

US_EPA_8270
type: Concept
definition: US EPA 8270 (SW-846) Semivolatile organic compounds by gas chromatography/mass spectrometry (GC-MS)
status: valid
status modified: 2025-08-25
accepted date: 2025-08-25
in scheme: Analysmetod

VDI_3499_1
type: Concept
definition: VDI 3499 part 1 Emission measurement - Determination of polychlorinated dibenzo-p-dioxins (PCDDs) and dibenzofurans (PCDFs) - Dilution method; Example of application of DIN EN 1948 for the concentration range < 0,1 ng I-TEQ/m<(hoch)3> and supplement to DIN EN 1948 for the concentration range > 0,1 ng I-TEQ/m<(hoch)3>; Determination in filter dust, ash and slag (VEREIN DEUTSCHER INGENIEURE)
status: valid
status modified: 2025-08-25
accepted date: 2025-08-25
in scheme: Analysmetod

VDI_3499_2
type: Concept
definition: VDI 3499 part 2 Emission measurement - Determination of polychlorinated dibenzo-p-dioxins (PCDDs) and dibenzofurans (PCDFs) Filter/condenser method; Example of application of DIN EN 1948 for the concentration range < 0,1 ng I-TEQ/m3 and supplement to DIN EN 1948 for the concentration range > 0,1 ng I-TEQ/m3 (VEREIN DEUTSCHER INGENIEURE)
status: valid
status modified: 2025-08-25
accepted date: 2025-08-25
in scheme: Analysmetod

WEIBULL_STOLDT_FAT
type: Concept
definition: Weibull-Stoldt method for determination of fat content in food meat products. Samples are hydrolysed with hydrochloric acid, the fat is filtered off on a fat-tight filter paper, washed and extracted. Calculation of total fat content follows gravimetrically after the extract has been dried to a constant weight
status: valid
status modified: 2025-08-25
accepted date: 2025-08-25
in scheme: Analysmetod

Zn_TOT
type: Concept
definition: Zn was determined by monitoring 64Zn in medium resolution using ICP-HRMS
status: valid
status modified: 2025-08-25
accepted date: 2025-08-25
in scheme: Analysmetod