Analysinstrument
type: ConceptScheme
notation: ANALYS_INSTR
is part of: DATA MATVARDE
registration status: Public draft
user modified: staffan
date modified: 2026-03-16 12:12:28.0
vocabulary type: Common
is numeric concept identifiers: false
is notations equal identifiers: false

AAFS
type: Concept
definition: Atomabsorptionsspektrofotometer utan flamma
status: valid
status modified: 2025-02-21
accepted date: 2025-02-21
in scheme: Analysinstrument

AAS
type: Concept
definition: Atomabsorptionsspektrofotometer med flamma
status: valid
status modified: 2025-02-21
accepted date: 2025-02-21
in scheme: Analysinstrument

AAS-GRAF
type: Concept
definition: Atomabsorptionsspektrometer med grafitugn
status: valid
status modified: 2025-02-21
accepted date: 2025-02-21
in scheme: Analysinstrument

AAS-O
type: Concept
definition: Atomabsorptionsspektrometer, odefinierat (med eller utan flamma)
status: valid
status modified: 2025-02-21
accepted date: 2025-02-21
in scheme: Analysinstrument

AFS
type: Concept
definition: Atomfluorescenspektrometri
status: valid
status modified: 2025-02-21
accepted date: 2025-02-21
in scheme: Analysinstrument

AUTOANALYS
type: Concept
definition: (Kalmar)
status: valid
status modified: 2025-02-21
accepted date: 2025-02-21
in scheme: Analysinstrument

BERAKNAT
type: Concept
definition: Beräknat värde
status: valid
status modified: 2025-02-21
accepted date: 2025-02-21
in scheme: Analysinstrument

CFA
type: Concept
definition: Kontinuerlig flödesanalys (CFA)
status: valid
status modified: 2025-02-21
accepted date: 2025-02-21
in scheme: Analysinstrument

CIC
type: Concept
definition: Förbränningsjonkromatografi (CIC, Combustion ion chromatograhy)
status: valid
status modified: 2025-02-21
accepted date: 2025-02-21
in scheme: Analysinstrument

COULOMETRI
type: Concept
definition: Coulometri, bestämmer mängden materia som omvandlas under en elektrolysreaktion genom att mäta mängden elektricitet (i coulombs ) som förbrukas eller produceras. Den kan användas för precisionsmätningar av laddningen, och ampererna har till och med haft en kulometrisk definition. Men idag används coulometri främst för analytiska tillämpningar. Coulometri är en grupp tekniker inom analytisk kemi . Den är uppkallad efter Charles-Augustin de Coulomb (Wikipedia)
status: valid
status modified: 2025-02-21
accepted date: 2025-02-21
in scheme: Analysinstrument

CV-AAS
type: Concept
definition: Atomabsorptionsspektrometer med cold vapor (kall ånga)
status: valid
status modified: 2025-02-21
accepted date: 2025-02-21
in scheme: Analysinstrument

CV-AFS
type: Concept
definition: Atomfluorescensspektrometer med cold vapor (kall ånga)
status: valid
status modified: 2025-02-21
accepted date: 2025-02-21
in scheme: Analysinstrument

CV-ICP-AES
type: Concept
definition: Kall ånga (cold vapour) med induktivt kopplad atomemissions-plasmaspektrograf
status: valid
status modified: 2025-02-21
accepted date: 2025-02-21
in scheme: Analysinstrument

DIGITAL_MULTIMETER
type: Concept
definition: Digital multimeter
status: valid
status modified: 2026-03-16
accepted date: 2026-03-16
in scheme: Analysinstrument

DMA80
type: Concept
definition: DMA-80 Direct Mercury Analyzer (Milstone Inc)
status: valid
status modified: 2025-02-21
accepted date: 2025-02-21
in scheme: Analysinstrument

DPASV
type: Concept
definition: Pulspolarografi
status: valid
status modified: 2025-02-21
accepted date: 2025-02-21
in scheme: Analysinstrument

DS_Spektrofotometer
type: Concept
definition: Dubbelstråle-spektrofotometer (Double-beam spectrophotometer)
status: valid
status modified: 2025-02-21
accepted date: 2025-02-21
in scheme: Analysinstrument

EA-IRMS
type: Concept
definition: Element-analysator-Isotopkvot mass-spektrometer
status: valid
status modified: 2025-02-21
accepted date: 2025-02-21
in scheme: Analysinstrument

ELEMENTARA
type: Concept
definition: Analysinstrument som använts i Kalmar
status: valid
status modified: 2025-02-21
accepted date: 2025-02-21
in scheme: Analysinstrument

ELEMENTAR_ANA
type: Concept
definition: Elementaranalysator
status: valid
status modified: 2025-02-21
accepted date: 2025-02-21
in scheme: Analysinstrument

Elementar_soli_TOC_cube_M_1143
type: Concept
definition: Elementar soli TOC cube (M-1143)
status: valid
status modified: 2025-02-21
accepted date: 2025-02-21
in scheme: Analysinstrument

FL
type: Concept
definition: Fluorescens
status: valid
status modified: 2025-02-21
accepted date: 2025-02-21
in scheme: Analysinstrument

FOTOMETER
type: Concept
definition: Fotometer, optiskt instrument för mätning av absorptionen av ljus av given våglängd i färgade lösningar
status: valid
status modified: 2025-02-21
accepted date: 2025-02-21
in scheme: Analysinstrument

FRYSTORK
type: Concept
definition: Analysinstrument som använts i Kalmar
status: valid
status modified: 2025-02-21
accepted date: 2025-02-21
in scheme: Analysinstrument

GAMSP-GELI
type: Concept
definition: Gammaspektrometer, Ge-Li-detektor
status: valid
status modified: 2025-02-21
accepted date: 2025-02-21
in scheme: Analysinstrument

GAMSP-NAI
type: Concept
definition: Gammaspektrometer, NaI-detektor
status: valid
status modified: 2025-02-21
accepted date: 2025-02-21
in scheme: Analysinstrument

GC
type: Concept
definition: Gaskromatograf
status: valid
status modified: 2025-02-21
accepted date: 2025-02-21
in scheme: Analysinstrument

GC-AED
type: Concept
definition: Gaskromatograf med atomemissionsdetektor
status: valid
status modified: 2025-02-21
accepted date: 2025-02-21
in scheme: Analysinstrument

GC-AFS
type: Concept
definition: Gaskromatograf med atomfluoroscensspektrometer
status: valid
status modified: 2025-03-18
accepted date: 2025-03-18
in scheme: Analysinstrument

GC-APCI-MS-MS
type: Concept
definition: Gaskromatograf-Atmosfäriskt tryck kemisk jonisering-Masspektrometer-Masspektrometer
status: valid
status modified: 2025-02-21
accepted date: 2025-02-21
in scheme: Analysinstrument

GC-ECD
type: Concept
definition: Gaskromatograf med elektronfångstdetektor
status: valid
status modified: 2025-02-21
accepted date: 2025-02-21
in scheme: Analysinstrument

GC-EI-MS
type: Concept
definition: Gaskromatograf med elektronjonisering-Masspektrometer
status: valid
status modified: 2025-02-21
accepted date: 2025-02-21
in scheme: Analysinstrument

GC-EI-MS-MS
type: Concept
definition: Gaskromatograf med elektronjonisering-Masspektrometer-Masspektrometer
status: valid
status modified: 2025-02-21
accepted date: 2025-02-21
in scheme: Analysinstrument

GC-FID
type: Concept
definition: Gaskromatograf med flamjoniseringsdetektor
status: valid
status modified: 2025-02-21
accepted date: 2025-02-21
in scheme: Analysinstrument

GC-FPD
type: Concept
definition: Gaskromatograf med flamfotometrisk detektor
status: valid
status modified: 2025-02-21
accepted date: 2025-02-21
in scheme: Analysinstrument

GC-HRMS
type: Concept
definition: Gaskromatograf med högupplösande masspektrometer
status: valid
status modified: 2025-02-21
accepted date: 2025-02-21
in scheme: Analysinstrument

GC-HRMS-ECNI
type: Concept
definition: Gaskromatograf-Högupplösande masspektrometer med elektronfångstdetektor och negativ kemisk jonisering
status: valid
status modified: 2025-02-21
accepted date: 2025-02-21
in scheme: Analysinstrument

GC-ICP-MS
type: Concept
definition: Gaskromatograf-Induktivt kopplad plasmamasspektrometer
status: valid
status modified: 2025-02-21
accepted date: 2025-02-21
in scheme: Analysinstrument

GC-ICP-QMS
type: Concept
definition: Gaskromatograf-Induktivt kopplad plasmamasspektrometer med kvadrupol
status: valid
status modified: 2025-02-21
accepted date: 2025-02-21
in scheme: Analysinstrument

GC-ICP-SFMS
type: Concept
definition: Gaskromatograf-Induktivt kopplad plasmamasspektrometer med magnetisk sektor för masseparation
status: valid
status modified: 2025-02-21
accepted date: 2025-02-21
in scheme: Analysinstrument

GC-MS
type: Concept
definition: Gaskromatograf med masspektrometer
status: valid
status modified: 2025-02-21
accepted date: 2025-02-21
in scheme: Analysinstrument

GC-MS-ECNI
type: Concept
definition: Gaskromatograf-Masspektrometer-Elektronfångstdetektor med negativ kemisk jonisering
status: valid
status modified: 2025-02-21
accepted date: 2025-02-21
in scheme: Analysinstrument

GC-MS-MS
type: Concept
definition: Gaskromatograf-Masspektrometer-Masspektrometer
status: valid
status modified: 2025-02-21
accepted date: 2025-02-21
in scheme: Analysinstrument

GC-MS-MS-NCI
type: Concept
definition: Gaskromatograf-Masspektrometer-Masspektrometer med negativ kemisk jonisering
status: valid
status modified: 2025-02-21
accepted date: 2025-02-21
in scheme: Analysinstrument

GC-MS-MS-QQQ
type: Concept
definition: Gaskromatograf-Masspektrometer-Masspektrometer med trippel kvadrupol
status: valid
status modified: 2025-02-21
accepted date: 2025-02-21
in scheme: Analysinstrument

GC-MS-MS_MRM
type: Concept
definition: Gaskromatograf-Masspektrometer-Masspektrometer med "multiple reaction monitoring"
status: valid
status modified: 2025-02-21
accepted date: 2025-02-21
in scheme: Analysinstrument

GC-MS-NCI
type: Concept
definition: Gaskromatograf-Masspektrometer med negativ kemisk jonisering
status: valid
status modified: 2025-02-21
accepted date: 2025-02-21
in scheme: Analysinstrument

GC-MS-SIR
type: Concept
definition: Gaskromatograf-Masspektrometer-Selected Ion Recording
status: valid
status modified: 2025-02-21
accepted date: 2025-02-21
in scheme: Analysinstrument

GC-MS_packad_kolonn
type: Concept
definition: Gaskromatograf-Masspektrometer, med packad GC-kolonn
status: valid
status modified: 2025-02-21
accepted date: 2025-02-21
in scheme: Analysinstrument

GC-NPD
type: Concept
definition: Gaskromatograf med kväve-fosfordetektor (NPD)
status: valid
status modified: 2025-02-21
accepted date: 2025-02-21
in scheme: Analysinstrument

GC-SIM-MS
type: Concept
definition: Gaskromatograf med selektiv jonanalys (selective ion monitoring)-Masspektrometer
status: valid
status modified: 2025-02-21
accepted date: 2025-02-21
in scheme: Analysinstrument

GC-SPI
type: Concept
definition: Gaskromatograf med SPI-injektor
status: valid
status modified: 2025-02-21
accepted date: 2025-02-21
in scheme: Analysinstrument

GC-TD-FID
type: Concept
definition: Gaskromatograf med flamjonisationsdetektor med termisk desorptionsenhet
status: valid
status modified: 2025-02-21
accepted date: 2025-02-21
in scheme: Analysinstrument

GC_X_GC-MS
type: Concept
definition: GCxGC-MS 2D-gaskromatografi-Masspektroskopi
status: valid
status modified: 2025-02-21
accepted date: 2025-02-21
in scheme: Analysinstrument

GPC
type: Concept
definition: Gelpermeationskromatografi
status: valid
status modified: 2025-02-21
accepted date: 2025-02-21
in scheme: Analysinstrument

GUTZEITGEN
type: Concept
definition: Gutzeitgenerator
status: valid
status modified: 2025-02-21
accepted date: 2025-02-21
in scheme: Analysinstrument

HG_DMA
type: Concept
definition: HG-DMA. Kvicksilveranalysator (Direct Mercury Analyser)
status: valid
status modified: 2025-02-21
accepted date: 2025-02-21
in scheme: Analysinstrument

HPLC
type: Concept
definition: Högupplösande vätskekromatograf
status: valid
status modified: 2025-02-21
accepted date: 2025-02-21
in scheme: Analysinstrument

HPLC-DAD
type: Concept
definition: Högupplösande vätskekromatograf med diodarraydetektor
status: valid
status modified: 2025-02-21
accepted date: 2025-02-21
in scheme: Analysinstrument

HPLC-ESI-MS-MS
type: Concept
definition: Högupplösande vätskekromatograf med elektrospray-jonisering-Masspektrometer-Masspektrometer
status: valid
status modified: 2025-02-21
accepted date: 2025-02-21
in scheme: Analysinstrument

HPLC-FLD
type: Concept
definition: Högupplösande vätskekromatograf med fluorescensdetektor
status: valid
status modified: 2025-02-21
accepted date: 2025-02-21
in scheme: Analysinstrument

HPLC-HRMS
type: Concept
definition: Högupplösande vätskekromatograf-Högupplösande masspektrometer
status: valid
status modified: 2025-02-21
accepted date: 2025-02-21
in scheme: Analysinstrument

HPLC-MS
type: Concept
definition: Högupplösande vätskekromatograf-Masspektrometer
status: valid
status modified: 2025-02-21
accepted date: 2025-02-21
in scheme: Analysinstrument

HPLC-MS-MS
type: Concept
definition: Högupplösande vätskekromatograf-Masspektrometer-Masspektrometer
status: valid
status modified: 2025-02-21
accepted date: 2025-02-21
in scheme: Analysinstrument

HPLC-MS-MS_MRM
type: Concept
definition: Högupplösande vätskekromatograf-Masspektrometer-Masspektrometer med "multiple reaction monitoring"
status: valid
status modified: 2025-02-21
accepted date: 2025-02-21
in scheme: Analysinstrument

HPLC-MS_orbitrap
type: Concept
definition: Högupplösande vätskekromatograf-masspektrometer med orbitrap
status: valid
status modified: 2025-02-21
accepted date: 2025-02-21
in scheme: Analysinstrument

HPLC-NESI
type: Concept
definition: Högupplösande vätskekromatograf-Negativ elektrosprayjonisering
status: valid
status modified: 2025-02-21
accepted date: 2025-02-21
in scheme: Analysinstrument

HPLC-PAD
type: Concept
definition: Högupplösande vätskekromatograf med fotodiodarray
status: valid
status modified: 2025-02-21
accepted date: 2025-02-21
in scheme: Analysinstrument

HPLC-UV
type: Concept
definition: Högupplösande vätskekromatograf med ultraviolettdetektor
status: valid
status modified: 2025-02-21
accepted date: 2025-02-21
in scheme: Analysinstrument

HPLC-UVFL
type: Concept
definition: Högupplösande vätskekromatograf med ultraviolett- och fluorescencdetektor
status: valid
status modified: 2025-02-21
accepted date: 2025-02-21
in scheme: Analysinstrument

HPLC–FLD-DAD
type: Concept
definition: Högupplösande vätskekromatograf med fluorescensdetektor och diodarraydetektor
status: valid
status modified: 2025-02-21
accepted date: 2025-02-21
in scheme: Analysinstrument

HR-ICP-MS
type: Concept
definition: Högupplösande ICP-MS, samma som ICP-SFMS
status: valid
status modified: 2025-02-21
accepted date: 2025-02-21
in scheme: Analysinstrument

HRGC
type: Concept
definition: Högupplösande gaskromatograf
status: valid
status modified: 2025-02-21
accepted date: 2025-02-21
in scheme: Analysinstrument

HRGC-HRMS
type: Concept
definition: Högupplösande gaskromatograf-högupplösande masspektrometer
status: valid
status modified: 2025-02-21
accepted date: 2025-02-21
in scheme: Analysinstrument

HRGC-MS
type: Concept
definition: Högupplösande gaskromatografi masspektrometer
status: valid
status modified: 2025-02-21
accepted date: 2025-02-21
in scheme: Analysinstrument

HRMS
type: Concept
definition: Högupplösande masspektrometer
status: valid
status modified: 2025-02-21
accepted date: 2025-02-21
in scheme: Analysinstrument

HS-SPME-GC-ECD
type: Concept
definition: Headspace fast fas-mikroextraktion kopplad till gaskromatografi med elektronfångstdetektor (HS-SPME-GC-ECD)
status: valid
status modified: 2025-02-21
accepted date: 2025-02-21
in scheme: Analysinstrument

HSGC
type: Concept
definition: Headspace gaskromatograf
status: valid
status modified: 2025-02-21
accepted date: 2025-02-21
in scheme: Analysinstrument

HSGC-MS
type: Concept
definition: Headspace gaskromatograf-Masspektrometer
status: valid
status modified: 2025-02-21
accepted date: 2025-02-21
in scheme: Analysinstrument

HSGC-SIM-MS
type: Concept
definition: Headspace gaskromatograf med selektiv jonanalys (selective ion monitoring)-Masspektrometer
status: valid
status modified: 2025-02-21
accepted date: 2025-02-21
in scheme: Analysinstrument

IC
type: Concept
definition: Jonbyteskromatofgrafi (ion-exchange chromatography)
status: valid
status modified: 2025-02-21
accepted date: 2025-02-21
in scheme: Analysinstrument

ICP-AES
type: Concept
definition: Induktivt kopplad atomemissions-plasmaspektrograf
status: valid
status modified: 2025-02-21
accepted date: 2025-02-21
in scheme: Analysinstrument

ICP-AES-SFMS
type: Concept
definition: Induktivt kopplad atomemissions-plasmaspektrograf ELLER Induktivt kopplat plasmamasspektrometer med magnetisk sektor för masseparation
status: valid
status modified: 2025-02-21
accepted date: 2025-02-21
in scheme: Analysinstrument

ICP-AFS
type: Concept
definition: Induktivt kopplad plasmamasspektrometer-Atomfluorescenspektrometer
status: valid
status modified: 2025-02-21
accepted date: 2025-02-21
in scheme: Analysinstrument

ICP-HRMS
type: Concept
definition: Induktivt kopplad högupplösande plasmamasspektrometer
status: valid
status modified: 2025-02-21
accepted date: 2025-02-21
in scheme: Analysinstrument

ICP-OES
type: Concept
definition: Induktivt kopplad plasmaoptisk emissionsspektrograf, samma som ICPAES
status: valid
status modified: 2025-02-21
accepted date: 2025-02-21
in scheme: Analysinstrument

ICP-QMS
type: Concept
definition: Induktivt kopplat plasmaspektrograf, samma som ICPMS
status: valid
status modified: 2025-02-21
accepted date: 2025-02-21
in scheme: Analysinstrument

ICP-SFMS
type: Concept
definition: Induktivt kopplat plasmamasspektrometer med magnetisk sektor för masseparation
status: valid
status modified: 2025-02-21
accepted date: 2025-02-21
in scheme: Analysinstrument

ICP-USN
type: Concept
definition: Induktivt kopplad plasmamasspektrometer med ultraljuds-nebulisator
status: valid
status modified: 2025-02-21
accepted date: 2025-02-21
in scheme: Analysinstrument

ICPAES
type: Concept
definition: Induktivt kopplad plasmaspektrograf
status: valid
status modified: 2025-02-21
accepted date: 2025-02-21
in scheme: Analysinstrument

ICPMS
type: Concept
definition: Induktivt kopplad plasmamasspektroskopi
status: valid
status modified: 2025-02-21
accepted date: 2025-02-21
in scheme: Analysinstrument

IR_detektion
type: Concept
definition: IR-detektion (infrarött-detektion)
status: valid
status modified: 2025-02-21
accepted date: 2025-02-21
in scheme: Analysinstrument

LC
type: Concept
definition: Vätskekromatograf
status: valid
status modified: 2025-02-21
accepted date: 2025-02-21
in scheme: Analysinstrument

LC-HRAM-MS
type: Concept
definition: Vätskekromatograf med högupplöst precisionsmassa (high resolution accurate mass)-Masspektrometer
status: valid
status modified: 2025-02-21
accepted date: 2025-02-21
in scheme: Analysinstrument

LC-MS
type: Concept
definition: Vätskekromatograf-Masspektrometer
status: valid
status modified: 2025-02-21
accepted date: 2025-02-21
in scheme: Analysinstrument

LC-MS-MS
type: Concept
definition: Vätskekromatograf-Masspektrometer-Masspektrometer
status: valid
status modified: 2025-02-21
accepted date: 2025-02-21
in scheme: Analysinstrument

LC-MS-MS-MRM
type: Concept
definition: Vätskekromatograf-Masspektrometer-Masspektrometer med "multiple reaction monitoring" (MRM)
status: valid
status modified: 2025-02-21
accepted date: 2025-02-21
in scheme: Analysinstrument

LC-MS-QQQ
type: Concept
definition: Vätskekromatograf-Masspektrometer med trippel kvadrupol
status: valid
status modified: 2025-02-21
accepted date: 2025-02-21
in scheme: Analysinstrument

LC-QQQ
type: Concept
definition: Vätskekromatograf-Trippel kvadrupol masspektrometer
status: valid
status modified: 2025-02-21
accepted date: 2025-02-21
in scheme: Analysinstrument

LECO_RC612_TempDiff
type: Concept
definition: LECO RC612 with its variable ramp furnace, wide range carbon detection range and simultaneous carbon and moisture determination, is optimized for the temperature differentiation analysis of forms of carbon - Total Organic Carbon (TOC) and Total Inorganic Carbon (TIC) - in soil, rock and shale
status: valid
status modified: 2025-02-21
accepted date: 2025-02-21
in scheme: Analysinstrument

LINJAL
type: Concept
definition: Linjal eller ekvivalent för mätning av längd
status: valid
status modified: 2025-02-21
accepted date: 2025-02-21
in scheme: Analysinstrument

LMICARLOERBA
type: Concept
definition: LMI, Carlo Erba Elemental Analyser
status: valid
status modified: 2025-02-21
accepted date: 2025-02-21
in scheme: Analysinstrument

LUMINOMETER
type: Concept
definition: Luminometer, en fotometer som mäter luminiscens
status: valid
status modified: 2025-02-21
accepted date: 2025-02-21
in scheme: Analysinstrument

LVI-GC-EI-MS-MS
type: Concept
definition: Gaskromatograf med stor injektionsvolym ("Large Volume Injection") och elektronjonisering-Masspektrometer-Masspektrometer
status: valid
status modified: 2025-02-21
accepted date: 2025-02-21
in scheme: Analysinstrument

LVI-GC-MS
type: Concept
definition: Gaskromatograf med stor injektionsvolym ("Large Volume Injection")-Masspektrometer
status: valid
status modified: 2025-02-21
accepted date: 2025-02-21
in scheme: Analysinstrument

LVI-GC-MS-NCI
type: Concept
definition: (LVI)-GC/MS NCI Gaskromatograf-Masspektrometer-Negativ kemisk jonisering, med "Large Volume Injection"
status: valid
status modified: 2025-02-21
accepted date: 2025-02-21
in scheme: Analysinstrument

MC-ICP-MS
type: Concept
definition: Induktivt kopplat plasmamasspektrometer med multikollektor
status: valid
status modified: 2025-02-21
accepted date: 2025-02-21
in scheme: Analysinstrument

MIKROFICHE_LASAPP
type: Concept
definition: Mikrofiche läsapparat
status: valid
status modified: 2025-02-21
accepted date: 2025-02-21
in scheme: Analysinstrument

MIKROMETER
type: Concept
definition: Instrument för mätning av tjocklek (t.ex. äggskalstjocklek)
status: valid
status modified: 2025-02-21
accepted date: 2025-02-21
in scheme: Analysinstrument

MM_MERC_ANAL
type: Concept
definition: Millennium Merlin mercury analyser, P S Analytical
status: valid
status modified: 2025-02-21
accepted date: 2025-02-21
in scheme: Analysinstrument

MS
type: Concept
definition: Masspektroskopi
status: valid
status modified: 2025-02-21
accepted date: 2025-02-21
in scheme: Analysinstrument

MS-ECNI
type: Concept
definition: Masspektrometer-Elektronfångstdetektor med negativ kemisk jonisering
status: valid
status modified: 2025-02-21
accepted date: 2025-02-21
in scheme: Analysinstrument

MS-NESI
type: Concept
definition: Masspektroskopi-Negativ elektrosprayjonisering
status: valid
status modified: 2025-02-21
accepted date: 2025-02-21
in scheme: Analysinstrument

NAA
type: Concept
definition: Neutronaktivering
status: valid
status modified: 2025-02-21
accepted date: 2025-02-21
in scheme: Analysinstrument

NMR
type: Concept
definition: Nukleär Magnetisk Resonans-analys
status: valid
status modified: 2025-02-21
accepted date: 2025-02-21
in scheme: Analysinstrument

O2_EL
type: Concept
definition: Syrgas-elektrod
status: valid
status modified: 2025-02-21
accepted date: 2025-02-21
in scheme: Analysinstrument

Online_SPE_LC-QQQ
type: Concept
definition: Online SPE/LC-QQQ: On-line fast fas extraktion kombinerat med vätskekromatografi och detektion med trippel kvadrupol masspektrometer
status: valid
status modified: 2025-02-21
accepted date: 2025-02-21
in scheme: Analysinstrument

PH_EL
type: Concept
definition: pH-elektrod
status: valid
status modified: 2025-02-21
accepted date: 2025-02-21
in scheme: Analysinstrument

SAKNAS
type: Concept
definition: Saknas, information ej tillgänglig
status: valid
status modified: 2025-02-21
accepted date: 2025-02-21
in scheme: Analysinstrument

SFC-MS-MS
type: Concept
definition: Superkritisk vätskekromatografi-Masspektrometer-Masspektrometer (SFC-MS/MS, Supercritical Fluid Chromatography tandem Mass Spectrometry)
status: valid
status modified: 2025-02-21
accepted date: 2025-02-21
in scheme: Analysinstrument

SKJUTMATT
type: Concept
definition: Skjutmått eller ekvivalent för mätning av längd
status: valid
status modified: 2025-02-21
accepted date: 2025-02-21
in scheme: Analysinstrument

SPFM
type: Concept
definition: Surface Plasmon Fluorescence Microscopy (SPFM)
status: valid
status modified: 2025-02-21
accepted date: 2025-02-21
in scheme: Analysinstrument

Spektrofotometer
type: Concept
definition: Spektrofotometer
status: valid
status modified: 2025-02-21
accepted date: 2025-02-21
in scheme: Analysinstrument

Stereomikroskop
type: Concept
definition: Stereomikroskop
status: valid
status modified: 2025-02-21
accepted date: 2025-02-21
in scheme: Analysinstrument

TITROROBOT
type: Concept
definition: Robot för titrering
status: valid
status modified: 2025-02-21
accepted date: 2025-02-21
in scheme: Analysinstrument

TOCL_680
type: Concept
definition: TOC-L Laboratory Total Organic Carbon Analyser med katalytisk förbränning (680°C), Shimadzu
status: valid
status modified: 2025-02-21
accepted date: 2025-02-21
in scheme: Analysinstrument

UFLC
type: Concept
definition: Ultrasnabb högupplösande vätskekromatograf
status: valid
status modified: 2025-02-21
accepted date: 2025-02-21
in scheme: Analysinstrument

UGN
type: Concept
definition: UGN
status: valid
status modified: 2025-02-21
accepted date: 2025-02-21
in scheme: Analysinstrument

UPLC_MS_MS
type: Concept
definition: UPLC-MS-MS - Ultrasnabb högupplösande vätskekromatograf-Masspektrometer-Masspektrometer
status: valid
status modified: 2025-02-21
accepted date: 2025-02-21
in scheme: Analysinstrument

VAG
type: Concept
definition: Våg eller ekvivalent för mätning av vikt
status: valid
status modified: 2025-02-21
accepted date: 2025-02-21
in scheme: Analysinstrument

VAPODEST
type: Concept
definition: Vapodest
status: valid
status modified: 2025-02-21
accepted date: 2025-02-21
in scheme: Analysinstrument

XRF
type: Concept
definition: Röntgefluorescens spektroskopi
status: valid
status modified: 2025-02-21
accepted date: 2025-02-21
in scheme: Analysinstrument